program: Gaussian 09
title: 000233167
version: EM64L-G09RevD.01
frameworkgroup: C1[X(C13H17BrO5)]
method: RPBEPBE
basis: SDD
operation: Freq
keyword: #p
keyword: freq=noraman
keyword: PBEPBE/SDD
title: #p freq=noraman PBEPBE/SDD
converged: YES YES NO NO
title: Mulliken charges:
elementType: Br O O O O O C C C C C C C C C C C C C H H H H H H H H H H H H H H H H H
charge: -0.015517 -0.276671 -0.263824 -0.261846 -0.294997 -0.282810 0.580198 -0.432703 0.197353 0.183867 -0.486808 -0.417551 -0.326914 -0.306805 -0.224413 -0.203073 -0.248158 -0.280422 -0.493976 0.249240 0.245828 0.300297 0.206182 0.219098 0.273780 0.207253 0.196540 0.242685 0.234866 0.205708 0.208948 0.200697 0.222407 0.206753 0.202493 0.232294
chargesum: 0.00000
title: Mulliken charges with hydrogens summed into heavy atoms:
elementType: Br O O O O O C C C C C C C C C C C C C
charge: -0.015517 -0.276671 -0.263824 -0.261846 -0.294997 -0.282810 0.580198 0.062365 0.197353 0.183867 -0.186511 -0.417551 0.098366 -0.033025 0.179381 0.274478 0.166497 0.142682 0.147564
polarizability: 1.73615283e+02 2.42927734e+01 1.69158681e+02 -3.41596184e+01 1.15036623e+01 1.69996821e+02
1716.lowfreq: -10.9260 -4.4991 0.0001 0.0003 0.0005 6.4833 9.8270 15.6839 22.7155
frequency: 9.3724 12.1139 22.5068 41.8451 57.6260 68.9452 76.1126 94.9522 103.9122 120.0091 134.6041 149.4291 170.3397 182.2867 219.9474 240.5055 254.4668 270.6612 290.5699 322.9256 330.8161 353.4312 405.3111 427.1074 442.6545 497.7696 515.5561 533.3207 600.8473 643.6455 677.2141 705.9379 741.9838 789.1625 801.0271 828.9724 833.4557 835.4860 852.4483 902.1811 909.9218 927.1291 956.5126 973.4376 988.8057 1013.7990 1053.4811 1061.8708 1069.3889 1070.7509 1081.3248 1095.2015 1102.1334 1113.1915 1124.9085 1125.9895 1141.2063 1164.7743 1172.6308 1199.9375 1204.8089 1248.0473 1254.2456 1258.3434 1278.7455 1318.5054 1333.8428 1359.3495 1362.4078 1368.2042 1390.2567 1403.0018 1407.8808 1437.8623 1439.3492 1445.2550 1457.0714 1458.8586 1465.9843 1470.1208 1483.2094 1485.0035 1493.3802 1603.1389 1622.0353 2920.2805 2924.7989 2941.8304 2949.0638 2966.9336 2978.7929 2986.4005 2989.0987 2998.9939 3002.4933 3018.4561 3047.5966 3072.3306 3103.5783 3109.7575 3185.8569 3191.8156
redmass: 6.0553 2.5153 4.9867 3.6858 4.2727 2.4201 3.3874 3.8324 3.0109 3.4986 7.8827 5.2795 4.2051 5.7655 1.2315 3.1551 7.0448 7.1332 3.6855 5.8038 6.6580 2.6276 4.4602 3.1529 2.7686 5.0917 6.2593 2.4059 6.4840 8.2904 9.4505 4.7641 6.3321 5.0525 3.6735 2.7179 1.7389 2.4260 1.4545 2.3565 1.7718 4.8638 2.8776 5.0170 2.3827 2.7302 3.9978 3.5580 1.5283 3.0947 3.8910 3.8256 1.4471 2.4790 1.3992 1.0851 2.0793 1.5596 1.1353 1.1581 1.2333 2.3695 1.6091 1.1581 1.1242 1.2204 1.8672 1.2939 1.2800 1.3577 1.9987 4.3440 1.4827 1.1734 1.1714 1.1774 1.0694 2.4853 1.0903 1.0629 1.2113 1.0734 1.0797 8.8442 9.4015 1.0589 1.0356 1.0546 1.0545 1.0717 1.0596 1.1025 1.0953 1.1027 1.0604 1.1101 1.1030 1.0983 1.0973 1.1111 1.0918 1.0937
irintensity: 0.1671 0.5471 0.9457 0.8378 1.1281 13.2528 0.5265 4.3243 4.5988 4.5411 2.8961 6.0057 13.2714 4.7962 6.9127 1.0394 1.3374 1.6227 2.0199 1.7634 2.8761 0.8644 3.8869 12.2536 3.1910 13.8574 10.2659 8.6377 1.1293 16.2519 1.2198 0.5820 0.5367 28.6418 10.1426 7.2853 8.1714 27.5125 20.8677 5.7209 44.0678 27.9119 35.3228 133.4096 30.1050 21.6336 30.7259 39.2170 15.0528 71.6171 176.9828 55.7412 3.3586 23.3428 0.3274 2.8553 13.0067 5.8507 7.5261 2.5589 2.9944 91.8762 82.4104 3.4930 5.6114 9.7210 40.5444 6.1702 1.9084 6.6404 41.1479 0.8795 2.2955 17.2761 1.3549 53.7911 4.9430 168.9105 10.8022 16.7920 17.0488 1.5443 8.2474 3.0820 1.5568 73.1199 61.0126 19.7287 87.4046 18.1090 30.1509 4.1066 114.8787 84.0240 122.0378 103.0926 7.9343 30.2635 32.1473 28.1874 3.4079 1.4685
temp: 298.150 k
press: 1.00000 atm
elementType: 35 8 8 8 8 8 6 6 6 6 6 6 6 6 6 6 6 6 6 1 1 1 1 1 1 1 1 1 1 1 1 1 1 1 1 1
symmnumber: 1
zpe: 737766.0 jmol-1
zpe.correction: 0.281000 hartree
zpe.thermalcorrener: 0.301435 hartree
zpe.thermalcorrenthalpy: 0.302380 hartree
zpe.thermalcorrgfe: 0.226342 hartree
zpe.sumelectzpe: -893.605821 hartree
zpe.sumelectthermal: -893.585386 hartree
zpe.sumelectthermalent: -893.584442 hartree
zpe.sumelectthermalfe: -893.660480 hartree
dipole: -0.1190 0.6528 -1.2491
dipole: 1.4144
quadrupole: -109.3725 -119.7437 -121.0690
quadrupole: 5.3460 -3.3039 5.3745
quadrupole: 7.3559 -3.0153 -4.3406 5.3460 -3.3039 5.3745
hfenergy: -893.8868214 hartree
pointgroup: C01 [X(C13H17Br1O5)]
dipole: 0.1845244 0.0828813 -0.5183954 debye
polarizability: 150.4528406|-1.5818282|180.1549177|39.6791935|1.6506304|182.1630266 unknown
InChI: InChI=1S/C13H17BrO5/c1-15-2-3-16-4-5-17-8-10-6-12-13(7-11(10)14)19-9-18-12/h6-7H,2-5,8-9H2,1H3
charge 0 multiplicity 1
36 atoms
Br 0.474513 -1.867828 2.817914
O  0.053964 2.698571 1.812837
O  -2.513546 0.399481 -2.034211
O  -2.334549 -1.985851 -1.820133
O  2.475533 1.38754 0.381547
O  3.783772 -1.355595 -1.673948
C  -0.539976 0.366731 1.187806
C  0.066117 1.292998 2.239866
C  -1.81087 0.061152 -0.848569
C  -1.707907 -1.33989 -0.725738
C  -1.245522 0.929133 0.083309
C  -0.460264 -1.042414 1.288394
C  1.362299 3.258199 1.447518
C  -1.033359 -1.933093 0.342016
C  1.944414 2.730864 0.134518
C  -3.022725 -0.893597 -2.56325
C  2.883333 0.703335 -0.851427
C  3.326637 -0.700966 -0.445325
C  4.186777 -2.739729 -1.439984
H  -0.539419 1.248584 3.166466
H  1.095133 0.966377 2.477436
H  -1.325333 2.015566 0.007345
H  2.097532 3.086684 2.261634
H  1.175314 4.342678 1.357468
H  -0.951869 -3.016769 0.443187
H  1.16032 2.703474 -0.652562
H  2.761817 3.406839 -0.207048
H  -2.765785 -0.971357 -3.630692
H  -4.110179 -0.95935 -2.371231
H  3.72184 1.242563 -1.341404
H  2.03315 0.645857 -1.563082
H  4.14839 -0.643448 0.301028
H  2.476704 -1.254149 0.007941
H  3.342735 -3.347636 -1.049139
H  5.032766 -2.802565 -0.722181
H  4.505049 -3.139589 -2.415602
