program: Gaussian 09
title: 000018374
version: EM64L-G09RevD.01
frameworkgroup: C1[X(C6H14N2)]
method: RPBEPBE
basis: SDD
operation: Freq
keyword: #pfreq=noraman
keyword: PBEPBE/SDD
title: #p freq=noraman PBEPBE/SDD
converged: YES YES NO NO
title: Mulliken charges:
elementType: N N C C C C C C H H H H H H H H H H H H H H
charge: -0.609629 -0.566123 -0.027292 -0.089832 -0.417382 -0.419366 -0.417437 -0.425170 0.175322 0.207893 0.181940 0.213766 0.215335 0.182807 0.188955 0.183524 0.176717 0.225124 0.257380 0.258392 0.248385 0.256691
chargesum: 0.00000
title: Mulliken charges with hydrogens summed into heavy atoms:
elementType: N N C C C C C C
charge: -0.093856 -0.061047 0.148030 0.118060 -0.021676 -0.021224 -0.044958 -0.023329
polarizability: 8.96847731e+01 7.07441911e-01 7.54991190e+01 1.42895536e+00 -1.02020623e+00 6.41512422e+01
1716.lowfreq: -22.1748 -0.0007 -0.0002 0.0002 9.8510 15.3109 106.5823 209.4198 235.0453
frequency: 106.5722 209.4136 235.0431 246.7242 255.9832 308.0846 340.5396 364.3450 420.1415 458.8963 476.0020 576.8446 631.3859 647.8980 766.7873 780.8364 847.2814 888.8996 932.8935 948.5929 1019.0741 1032.1349 1053.2840 1060.7259 1089.7060 1106.1113 1119.7940 1164.4481 1196.9235 1238.0399 1244.8644 1254.9384 1293.5614 1305.8505 1311.9355 1326.3462 1333.7355 1365.9017 1374.3066 1380.0661 1456.1518 1460.4000 1466.7880 1474.5352 1634.3871 1635.3888 2830.2294 2947.9866 2951.0704 2966.3744 2970.7012 2974.9490 3016.5642 3027.8203 3034.5561 3052.2795 3417.6418 3433.1034 3544.0758 3560.6336
redmass: 3.3373 1.4701 1.2707 1.2803 2.0339 2.0675 2.5846 4.2022 1.6109 2.1122 2.9534 2.0246 1.4823 1.5584 2.6500 1.4553 2.0441 1.4899 1.7280 2.0307 1.4559 2.2680 1.2450 1.2345 2.6242 2.6391 2.3075 1.8434 1.4825 1.3311 1.2817 1.3919 1.3699 1.2328 1.3216 1.2834 1.4899 1.6355 1.6817 1.5732 1.0934 1.0879 1.0858 1.0946 1.0990 1.0939 1.0811 1.0674 1.0639 1.0614 1.0650 1.0776 1.0992 1.1017 1.1001 1.0958 1.0444 1.0446 1.0962 1.0970
irintensity: 0.2263 10.0564 45.2569 18.2066 7.8438 32.3765 7.9770 1.6220 1.7006 20.3577 8.1431 53.7090 154.2129 224.4920 2.8107 0.6560 8.3703 19.2236 1.8908 2.7782 4.7316 0.2570 4.3591 0.9638 1.2169 15.2601 18.2726 3.6516 2.8458 0.8041 1.7440 1.9822 0.0877 1.6613 0.6267 0.6368 2.0947 9.8722 5.8972 14.5945 6.0231 6.5308 16.8526 3.3784 44.9584 42.2731 91.9822 14.8149 37.9628 65.0941 49.5551 34.2859 61.8370 7.5232 92.2616 61.6677 3.1821 3.9962 0.1354 0.0200
temp: 298.150 k
press: 1.00000 atm
elementType: 7 7 6 6 6 6 6 6 1 1 1 1 1 1 1 1 1 1 1 1 1 1
symmnumber: 1
zpe: 523788.2 jmol-1
zpe.correction: 0.199500 hartree
zpe.thermalcorrener: 0.208218 hartree
zpe.thermalcorrenthalpy: 0.209162 hartree
zpe.thermalcorrgfe: 0.167117 hartree
zpe.sumelectzpe: -345.859857 hartree
zpe.sumelectthermal: -345.851139 hartree
zpe.sumelectthermalent: -345.850195 hartree
zpe.sumelectthermalfe: -345.892240 hartree
dipole: -0.6060 1.1147 1.7752
dipole: 2.1821
quadrupole: -50.4065 -50.0410 -50.9693
quadrupole: 4.7443 -2.0668 -0.9516
quadrupole: 0.0658 0.4313 -0.4970 4.7443 -2.0668 -0.9516
hfenergy: -346.0593569 hartree
pointgroup: C01 [X(C6H14N2)]
dipole: 0.2412725 0.4429849 -0.6946566 debye
dipolederiv: -0.6805634 0.0074761 -0.1154723 0.0086079 -0.2173471 0.0019107 -0.1706189 0.0021246 -0.636558 -0.822357 -0.2008462 0.0192343 -0.2778503 -0.5099968 0.1307851 0.093146 0.1305534 -0.2192194 0.5829418 -0.009046 0.1202818 -0.0169711 0.1534619 -0.0022195 -0.0082009 -0.0005198 0.400879 0.5895996 0.0862772 0.0207025 0.0450829 0.2958855 -0.0709212 0.0068859 -0.061102 0.2425416 -0.0411433 0.0397676 -0.0021699 0.0510206 0.0537434 -0.0430317 0.0123516 -0.0225553 0.1068031 -0.0138798 -0.0391649 -0.0012878 -0.0653892 0.0688185 0.038715 0.005067 0.0231247 0.1089997 -0.0921763 -0.0614821 -0.0082221 -0.1058895 -0.014059 0.0487663 0.0426447 0.0405044 0.1492989 -0.0216502 0.029034 -0.0047586 0.0308683 0.0074426 -0.0233373 0.0475274 0.0003008 0.1741574 -0.0737036 0.0015819 -0.0872809 0.002039 -0.0109038 0.0025186 -0.0954131 0.0032056 -0.2976029 0.009201 -0.0049855 -0.0366597 -0.0202756 0.0202104 -0.0078019 -0.0171025 -0.0013991 -0.189649 -0.0633222 -0.1335076 0.0367938 -0.1206592 -0.1500348 0.0572754 0.0608469 0.084614 0.0464608 0.0519105 0.0102785 -0.01593 0.0218977 0.0711359 0.024943 -0.0322814 -0.036186 -0.1589733 0.0495105 -0.0103223 -0.0190682 -0.0211444 0.0716283 -0.0224284 -0.0323761 0.0382794 -0.1566554 -0.0418216 0.1280354 0.0372861 0.1131366 -0.1512905 -0.0596795 0.061672 -0.0915528 0.0446615 -0.0412984 0.1224703 0.0394771 0.1115207 -0.1434442 -0.0558072 0.0556599 -0.0885832 0.0398517 0.0291548 -0.0100604 -0.0273083 -0.0314456 0.0613075 -0.0329695 -0.0513384 0.041176 -0.1944242 0.0288091 0.013471 -0.0294733 0.0364671 0.0637203 0.0301272 -0.0580674 -0.0402869 -0.1999999 -0.0037676 -0.1068384 0.032991 -0.0938609 -0.1157394 0.0520357 0.0368505 0.0746242 0.0527428 0.0960233 -0.0530712 0.0165458 -0.103008 0.0579708 0.0827898 0.1020937 0.1381522 0.264462 0.0982191 0.0530648 0.0143681 0.1020837 0.0554866 -0.0831105 0.100946 -0.1413982 0.2644542 0.1943294 0.0514544 0.0510665 0.0961294 0.2781592 0.045312 -0.0692638 -0.0182148 -0.0394873 0.1659842 0.0864132 -0.0411159 0.2376398 0.0538448 -0.113872 -0.091029 -0.0748611 0.1972566 unknown
polarizability: 89.6754168|-0.8733926|75.4947305|1.3602952|1.121848|64.164987 unknown
InChI: InChI=1S/C6H14N2/c7-5-1-2-6(8)4-3-5/h5-6H,1-4,7-8H2
charge 0 multiplicity 1
22 atoms
N  2.886681 -0.010804 0.057291
N  -2.899219 -0.029222 -0.049626
C  1.472026 0.007623 -0.374568
C  -1.462325 0.029278 0.312606
C  0.779566 1.278997 0.168014
C  0.749759 -1.25201 0.157469
C  -0.722133 1.298376 -0.201839
C  -0.753527 -1.245513 -0.201135
H  1.357425 0.013729 -1.490673
H  -1.407307 0.026299 1.421322
H  1.284054 2.185514 -0.225263
H  0.90711 1.289673 1.268995
H  0.883229 -1.279002 1.257218
H  1.231829 -2.164829 -0.248822
H  -1.207412 2.205391 0.211152
H  -0.837656 1.345754 -1.306271
H  -0.873393 -1.297263 -1.30589
H  -1.26258 -2.131597 0.21935
H  3.409549 0.831295 -0.209031
H  3.387565 -0.866116 -0.20919
H  -3.045443 -0.116497 -1.063615
H  -3.447999 0.750424 0.332807
