program: Gaussian 09
title: 000233155
version: EM64L-G09RevD.01
frameworkgroup: C1[X(C11H20N2O2)]
method: RPBEPBE
basis: SDD
operation: Freq
keyword: #p
keyword: freq=noraman
keyword: PBEPBE/SDD
title: #p freq=noraman PBEPBE/SDD
converged: YES YES NO NO
title: Mulliken charges:
elementType: O O N N C C C C C C C C C C C H H H H H H H H H H H H H H H H H H H H
charge: -0.191742 -0.216134 -0.453828 -0.644038 0.000621 -0.239933 -0.384610 -0.528076 -0.748646 -0.375647 0.247033 -0.697562 -0.030176 -0.596614 0.270683 0.213091 0.196854 0.218412 0.159289 0.246320 0.220705 0.223751 0.214237 0.240823 0.212117 0.194439 0.214269 0.204228 0.219715 0.209139 0.305683 0.215518 0.223352 0.346390 0.310337
chargesum: 0.00000
title: Mulliken charges with hydrogens summed into heavy atoms:
elementType: O O N N C C C C C C C C C C C
charge: -0.191742 -0.216134 -0.148145 0.012690 0.213712 -0.043079 -0.006910 -0.061052 -0.069835 0.030909 0.247033 -0.059350 0.178963 -0.157744 0.270683
polarizability: 1.70072319e+02 -8.41454418e+00 1.25437567e+02 7.53100522e+00 -9.03610375e+00 1.23696601e+02
1716.lowfreq: -8.5519 -5.7888 -0.0008 -0.0006 -0.0005 7.6256 18.7843 31.8108 34.6691
frequency: 18.6157 31.7770 34.5453 50.5016 58.1171 66.4030 89.7905 106.3493 132.2127 144.0431 180.3425 196.7253 210.7277 238.6153 241.9378 290.0492 303.2362 335.7354 362.7214 389.3277 429.4079 434.3773 462.7704 502.3959 551.8797 561.8128 595.1530 635.4280 691.2739 710.1579 742.2909 772.0013 796.7785 856.6543 874.4311 892.3296 914.0377 929.3456 936.5939 948.0911 971.4211 997.6771 1008.3483 1040.3948 1054.8022 1057.9315 1075.5131 1089.2065 1107.6998 1129.9503 1160.6229 1174.7652 1209.7466 1232.2305 1246.6357 1268.1010 1281.2149 1288.5786 1294.0961 1296.2710 1310.9373 1336.9956 1347.0299 1362.5915 1388.8576 1399.0673 1424.9781 1426.4894 1459.5395 1460.7912 1473.5112 1477.0967 1478.1543 1484.2889 1487.5338 1604.8170 1640.8585 1657.6317 1695.1185 2925.9199 2939.4603 2963.3998 2970.8768 2973.1353 2975.1864 2990.7987 3002.2493 3034.2388 3056.2103 3069.0806 3072.6939 3074.4088 3083.6701 3087.5296 3090.6638 3195.0037 3521.4088 3529.5999 3682.8368
redmass: 3.8057 6.2985 3.5492 3.3052 2.1829 2.2979 2.3936 3.7583 3.4242 2.9933 3.4256 2.1025 1.5676 1.2624 3.0143 2.9116 4.3430 2.9856 2.2767 2.2200 2.1731 1.5100 3.1051 2.6794 1.1926 2.8420 1.1828 1.5795 5.9378 6.4746 1.1170 4.3300 2.7838 1.3041 2.1100 2.4733 1.7755 2.0614 2.3982 1.3998 1.9306 1.3059 1.2152 2.3480 2.0098 2.6728 1.4780 2.9616 1.7697 2.4802 2.5455 2.1047 1.3652 1.3736 1.2842 1.3348 1.2527 1.7621 1.4310 1.3185 1.2988 1.3950 1.5292 1.5286 1.2125 1.2094 1.8444 1.2895 1.0856 1.0713 1.0648 1.0578 1.0467 1.0607 1.0613 1.2122 4.9985 4.7792 6.9045 1.0652 1.0803 1.0831 1.0378 1.0615 1.0675 1.0365 1.0920 1.1001 1.0852 1.1010 1.0992 1.0891 1.0995 1.0974 1.0711 1.1147 1.0702 1.0514 1.1040
irintensity: 8.1799 1.3025 8.7577 1.3036 0.2384 0.4992 0.1482 2.7363 3.6716 0.2099 0.2112 0.6539 0.1779 0.1767 0.4824 1.6085 3.9023 1.0486 1.8696 18.7678 3.3694 75.2945 2.3957 7.8511 236.2350 11.4266 71.7886 17.4955 4.3425 38.4527 6.9225 17.1401 2.0141 0.9011 10.9157 1.3987 15.9104 21.0273 5.7612 68.7164 16.6585 1.7747 14.1895 2.9828 14.3454 0.7202 1.1916 1.1566 28.6812 77.2140 126.0670 9.6238 2.2286 8.5319 33.0039 24.2571 1.2406 72.8630 47.4142 2.7083 14.5778 0.9408 3.9946 4.4881 11.7969 37.0056 582.7166 84.0863 13.5831 2.4599 1.3239 6.9817 14.3530 5.8781 19.8745 64.2371 48.4601 15.7463 364.2156 24.5519 54.5473 10.2366 51.6207 19.7966 21.7248 15.5873 23.9017 17.5745 6.9008 71.5238 46.1349 36.8052 32.7462 36.8460 5.1687 26.9524 11.6556 38.7968 31.6493
temp: 298.150 k
press: 1.00000 atm
elementType: 8 8 7 7 6 6 6 6 6 6 6 6 6 6 6 1 1 1 1 1 1 1 1 1 1 1 1 1 1 1 1 1 1 1 1
symmnumber: 1
zpe: 782709.7 jmol-1
zpe.correction: 0.298118 hartree
zpe.thermalcorrener: 0.316579 hartree
zpe.thermalcorrenthalpy: 0.317523 hartree
zpe.thermalcorrgfe: 0.248986 hartree
zpe.sumelectzpe: -689.928832 hartree
zpe.sumelectthermal: -689.910371 hartree
zpe.sumelectthermalent: -689.909427 hartree
zpe.sumelectthermalfe: -689.977964 hartree
dipole: 0.5155 2.8766 -6.1825
dipole: 6.8385
quadrupole: -85.8463 -99.7245 -90.1932
quadrupole: -3.7066 17.5769 6.3284
quadrupole: 6.0751 -7.8032 1.7281 -3.7066 17.5769 6.3284
hfenergy: -690.2269499 hartree
pointgroup: C01 [X(C11H20N2O2)]
dipole: -0.2233649 1.1575598 2.4184163 debye
polarizability: 169.7419218|9.3502667|125.9992323|7.2254126|9.1456646|123.4653332 unknown
InChI: InChI=1S/C11H20N2O2/c1-4-6-8(3)9(7-5-2)10(14)13-11(12)15/h5,8-9,13H,2,4,6-7,12H2,1,3H3
charge 0 multiplicity 1
35 atoms
O  0.833071 -1.800611 -1.117974
O  3.549703 -0.610486 -1.085516
N  1.794632 -0.412328 0.517988
N  4.035505 -0.130122 1.14415
C  -1.243302 0.674384 -0.268104
C  -0.672693 -0.616519 0.431271
C  -0.451829 1.947937 0.141316
C  -1.635938 -1.836849 0.334673
C  -1.343215 0.526482 -1.804653
C  -1.158979 3.276519 -0.218288
C  0.699026 -1.012948 -0.150193
C  -0.400523 4.512164 0.313201
C  -2.972131 -1.59162 1.001937
C  -4.185116 -1.772642 0.421219
C  3.16444 -0.417869 0.091136
H  -2.274044 0.781984 0.132538
H  -0.548389 -0.363624 1.508136
H  0.552285 1.936543 -0.330249
H  -0.289748 1.93621 1.243141
H  -1.767715 -2.121445 -0.72295
H  -1.138973 -2.700884 0.82295
H  -1.910115 -0.376063 -2.091212
H  -1.862638 1.395807 -2.244989
H  -0.343406 0.449941 -2.26911
H  -1.263233 3.358968 -1.317037
H  -2.188254 3.264329 0.195215
H  0.624074 4.557056 -0.101918
H  -0.315486 4.483783 1.41636
H  -0.916069 5.450683 0.039092
H  -2.931846 -1.26344 2.054428
H  1.56593 0.16289 1.332542
H  -5.118291 -1.603935 0.970682
H  -4.277125 -2.101508 -0.621396
H  5.023615 -0.051703 0.91111
H  3.767173 -0.204583 2.123905
