program: Gaussian 09
title: 000018379
version: EM64L-G09RevD.01
frameworkgroup: C1[X(C10H20O2)]
method: RPBEPBE
basis: SDD
operation: Freq
keyword: #pfreq=noraman
keyword: PBEPBE/SDD
title: #p freq=noraman PBEPBE/SDD
converged: YES YES NO NO
title: Mulliken charges:
elementType: O O C C C C C C C C C C H H H H H H H H H H H H H H H H H H H H
charge: -0.415781 -0.239298 -0.106738 -0.430751 -0.430799 -0.353201 -0.353293 -0.356068 -0.356025 0.133496 -0.698731 -0.698732 0.235280 0.199904 0.221119 0.221220 0.199797 0.191205 0.205868 0.205871 0.191073 0.200400 0.193230 0.193195 0.200444 0.210206 0.216531 0.212227 0.216533 0.210185 0.212235 0.369398
chargesum: 0.00000
title: Mulliken charges with hydrogens summed into heavy atoms:
elementType: O O C C C C C C C C C C
charge: -0.046383 -0.239298 0.128542 -0.009728 -0.009782 0.043872 0.043651 0.037562 0.037615 0.133496 -0.059767 -0.059780
polarizability: 1.35621382e+02 -1.00041359e-02 1.08876565e+02 3.06165057e-02 -1.88347142e+00 9.97964063e+01
1716.lowfreq: -0.0005 -0.0005 0.0008 6.6514 7.7364 9.2989 32.0342 41.3899 53.2427
frequency: 32.0213 40.9638 53.1331 58.5043 65.7849 74.5439 114.2184 131.5029 155.8443 201.4274 225.0771 230.0523 233.3701 254.6770 265.1880 387.6165 415.6417 436.8751 512.0531 586.1690 635.8468 717.5908 724.6738 736.3004 746.4818 788.5748 828.5521 891.3585 891.7905 912.9998 954.2754 988.7513 1007.0946 1039.0432 1044.2534 1056.4730 1067.3543 1084.4419 1091.8823 1113.3132 1125.2117 1142.1413 1205.4279 1212.0431 1236.2533 1242.2851 1264.9194 1276.7483 1285.4359 1291.3243 1296.1937 1300.1655 1331.0406 1333.7156 1354.5076 1360.2514 1376.2715 1391.0635 1391.4613 1454.5171 1461.6428 1465.0384 1466.3114 1475.4974 1476.8025 1477.4712 1477.5436 1486.6149 1486.8795 1656.6302 2958.6124 2958.9303 2967.2179 2967.4965 2973.2813 2973.4442 2975.7293 2979.0464 2998.0451 2998.2525 3015.2599 3020.7886 3026.5767 3043.6422 3053.4199 3069.8950 3070.1635 3072.5849 3072.6887 3493.3596
redmass: 6.6374 3.3184 1.6778 2.3576 2.2017 3.4487 2.8695 2.2227 2.4069 2.1734 1.2966 2.7479 1.2073 3.0069 3.5872 2.8209 3.5072 3.4273 3.2006 3.2221 1.2566 1.5133 1.2599 1.6412 1.6639 1.3695 1.4087 1.7323 1.9497 1.2947 1.2836 4.2596 3.3943 3.0771 1.5146 2.3014 2.4076 2.3417 1.9169 2.2286 1.9117 2.4070 1.5087 1.4471 1.2394 1.5401 1.2815 1.2214 1.2217 1.0767 1.0890 1.2181 1.4182 1.3799 1.5901 1.5997 1.6438 1.2149 1.2219 1.0767 1.0760 1.0761 1.0798 1.0672 1.0674 1.0432 1.0444 1.0792 1.0812 7.7541 1.0587 1.0589 1.0594 1.0595 1.0362 1.0362 1.0595 1.0592 1.0982 1.0981 1.0911 1.1024 1.0987 1.1047 1.1008 1.1007 1.1007 1.0993 1.0993 1.0636
irintensity: 2.4062 0.0167 0.2099 0.0506 0.0763 0.0971 0.0668 0.0405 0.0783 0.0002 0.2773 0.1204 0.0003 1.6614 1.3920 0.1694 10.3503 2.6196 16.2387 5.7659 126.4915 24.3023 23.1960 15.0380 1.9411 2.4205 0.6837 4.4226 2.7951 0.6973 5.6637 0.8908 68.6610 98.4767 0.0375 90.4902 4.0623 1.7001 16.8015 2.7731 1.5552 21.9993 0.4105 3.6379 3.7103 1.4262 0.8616 0.0015 5.0575 0.2087 1.7451 0.2136 0.1998 1.8728 3.0629 2.1707 22.9776 12.9634 6.2335 0.0382 3.5135 0.1617 2.7357 3.7875 9.8142 4.1553 18.6827 2.4983 32.4878 169.2729 0.8533 2.5442 1.2785 66.4556 60.0992 16.9045 0.4788 119.9741 0.1285 0.6792 9.4700 0.0117 27.1381 0.2034 74.7939 2.5466 181.4117 38.0627 68.1422 16.3551
temp: 298.150 k
press: 1.00000 atm
elementType: 8 8 6 6 6 6 6 6 6 6 6 6 1 1 1 1 1 1 1 1 1 1 1 1 1 1 1 1 1 1 1 1
symmnumber: 1
zpe: 743392.7 jmol-1
zpe.correction: 0.283143 hartree
zpe.thermalcorrener: 0.298747 hartree
zpe.thermalcorrenthalpy: 0.299692 hartree
zpe.thermalcorrgfe: 0.238306 hartree
zpe.sumelectzpe: -542.527699 hartree
zpe.sumelectthermal: -542.512095 hartree
zpe.sumelectthermalent: -542.511151 hartree
zpe.sumelectthermalfe: -542.572536 hartree
dipole: -0.0047 -0.7370 -1.3056
dipole: 1.4992
quadrupole: -74.7712 -71.1080 -81.6256
quadrupole: -0.0146 -0.0113 -2.2842
quadrupole: 1.0637 4.7269 -5.7907 -0.0146 -0.0113 -2.2842
hfenergy: -542.8108427 hartree
pointgroup: C01 [X(C10H20O2)]
dipole: 0.0001108 0.311341 0.5009744 debye
polarizability: 135.620368|-0.1661749|108.7029528|-0.0398107|-2.2586977|99.9710316 unknown
InChI: InChI=1S/C10H20O2/c1-3-5-7-9(10(11)12)8-6-4-2/h9,11H,3-8H2,1-2H3
charge 0 multiplicity 1
32 atoms
O  -0.008801 -2.203919 0.967694
O  0.001419 -1.790088 -1.31356
C  0.012288 0.122329 0.261735
C  -1.266956 0.820971 -0.282584
C  1.300815 0.802775 -0.283206
C  -2.58696 0.263523 0.294016
C  2.61296 0.229636 0.296146
C  -3.829258 1.029404 -0.215172
C  3.865793 0.97696 -0.214958
C  0.00158 -1.343705 -0.143439
C  -5.152287 0.472823 0.353112
C  5.180856 0.404919 0.356506
H  0.012566 0.165488 1.366864
H  -1.189395 1.900789 -0.043635
H  -1.274843 0.732989 -1.387087
H  1.308572 0.711466 -1.387419
H  1.237377 1.884181 -0.047274
H  -2.556914 0.30706 1.402473
H  -2.69032 -0.808199 0.026723
H  2.702169 -0.844279 0.032591
H  2.582926 0.277723 1.404419
H  -3.853829 0.98591 -1.323012
H  -3.732312 2.101751 0.052228
H  3.782951 2.051476 0.048441
H  3.890556 0.928974 -1.32259
H  -5.164439 0.529177 1.458018
H  -6.024446 1.037788 -0.023927
H  -5.289212 -0.587994 0.070609
H  6.060811 0.956588 -0.022109
H  5.193009 0.465527 1.461189
H  5.303708 -0.658756 0.078315
H  -0.015684 -3.147686 0.646293
