program: Gaussian 09
title: 000233148
version: EM64L-G09RevD.01
frameworkgroup: C1[X(C10H10O3)]
method: RPBEPBE
basis: SDD
operation: Freq
keyword: #pfreq=noraman
keyword: PBEPBE/SDD
title: #p freq=noraman PBEPBE/SDD
converged: YES YES YES YES
title: Mulliken charges:
elementType: O O O C C C C C C C C C C H H H H H H H H H H
charge: -0.318707 -0.205836 -0.424389 -0.538732 0.348393 -0.523439 0.189162 -0.008762 -0.505015 -0.497002 0.232164 0.159184 -0.522288 0.235937 0.235940 0.251814 0.251803 0.254302 0.295435 0.380183 0.230831 0.230831 0.248189
chargesum: 0.00000
title: Mulliken charges with hydrogens summed into heavy atoms:
elementType: O O O C C C C C C C C C C
charge: -0.318707 -0.205836 -0.044205 -0.066854 0.348393 -0.019822 0.189162 -0.008762 -0.250713 -0.201567 0.232164 0.159184 0.187563
polarizability: 1.78802876e+02 3.79731574e+00 1.26210276e+02 -2.07165672e-03 -6.76404617e-03 5.94533386e+01
1716.lowfreq: -7.2536 -5.3278 -0.0008 -0.0005 -0.0003 5.7511 64.6772 73.2794 120.0835
frequency: 64.6738 73.2759 120.0835 143.0629 174.5012 195.3161 231.1631 253.1562 304.0718 357.8161 429.4005 437.6191 457.1908 485.3195 504.9312 523.2183 592.4050 614.2396 634.0581 698.7922 722.0092 735.4914 797.3252 818.8512 855.5616 898.5669 950.6167 997.4180 998.7833 1014.1768 1104.3836 1116.1451 1135.4781 1148.5548 1163.5496 1173.0433 1199.5637 1200.7361 1251.1410 1256.6109 1272.5900 1318.1708 1416.6101 1429.8287 1439.6083 1455.5326 1463.7534 1465.5281 1472.2606 1496.7203 1599.9894 1616.2963 1633.5919 2972.8176 2990.9593 3017.6420 3035.9653 3065.4824 3074.9103 3133.6743 3148.7506 3174.1010 3513.3835
redmass: 3.4934 2.0961 4.7421 3.8578 3.6900 1.3811 6.9952 2.4056 5.1790 4.9235 5.3140 3.1268 5.7985 1.1059 6.0553 3.2534 4.6029 6.2880 2.9420 6.0763 3.3511 6.2606 4.2798 1.4977 1.5214 1.4967 6.4581 2.4659 2.0813 4.0965 6.2277 1.2561 1.2045 1.5221 1.6555 3.6451 1.2997 1.1138 1.6206 1.7042 1.8517 3.6761 4.9807 1.2120 1.2288 2.6761 1.1662 1.0494 1.1554 3.1650 8.0619 8.7546 9.5341 1.0322 1.0597 1.0618 1.1025 1.1047 1.1016 1.1006 1.0915 1.0932 1.0645
irintensity: 0.5319 1.7571 7.5261 0.0753 0.4599 0.0104 3.0638 0.1625 7.2951 3.5807 9.0439 8.0023 2.5201 139.9510 32.6393 7.3484 2.3119 8.3250 4.1032 4.6199 0.0411 1.5185 50.5792 0.0277 44.8873 16.4360 14.1166 6.1966 0.5541 47.1610 90.3873 0.1290 0.2688 17.1659 28.2062 52.7754 71.6868 0.0035 1.6151 231.6487 100.1461 217.2739 60.2892 1.3341 19.4201 10.6697 22.1598 15.8268 64.7873 118.7764 19.5759 314.1342 70.0364 56.1038 32.5574 16.1899 10.0019 38.9045 15.1917 19.8380 10.1000 3.9473 80.6372
temp: 298.150 k
press: 1.00000 atm
elementType: 8 8 8 6 6 6 6 6 6 6 6 6 6 1 1 1 1 1 1 1 1 1 1
symmnumber: 1
zpe: 466785.7 jmol-1
zpe.correction: 0.177789 hartree
zpe.thermalcorrener: 0.189444 hartree
zpe.thermalcorrenthalpy: 0.190388 hartree
zpe.thermalcorrgfe: 0.140057 hartree
zpe.sumelectzpe: -611.783188 hartree
zpe.sumelectthermal: -611.771534 hartree
zpe.sumelectthermalent: -611.770590 hartree
zpe.sumelectthermalfe: -611.820920 hartree
dipole: -4.7105 -6.0752 0.0008
dipole: 7.6875
quadrupole: -71.7425 -75.8731 -76.3954
quadrupole: -3.4737 0.0010 0.0004
quadrupole: 2.9278 -1.2028 -1.7251 -3.4737 0.0010 0.0004
hfenergy: -611.9609777 hartree
pointgroup: C01 [X(C10H10O3)]
dipole: 1.8288904 2.4088741 0.0003299 debye
dipolederiv: -1.7697853 -0.4853392 -0.0000653 -0.4367337 -0.5503922 -0.0000303 -0.0000588 -0.000036 -0.2999443 -1.0242429 -0.3061368 -0.0000271 -0.5295361 -0.8555498 -0.000047 -0.0001409 -0.000129 -0.3354801 -0.8524965 0.6399875 0.0000537 0.7313649 -0.755662 -0.0000265 0.0000602 -0.0000278 -0.4085869 0.0117085 -0.0162748 -0.0000014 0.0551048 -0.0300345 0.0000062 -0.0000179 0.0000589 0.1695632 0.2329134 -0.1198398 0.0000044 0.0374493 0.1512116 0.0000004 0.0000823 -0.0000267 -0.0530951 -0.111608 0.227026 0.0000228 0.1555549 -0.3713571 -0.0000699 0.0000007 -0.0000672 0.1111072 -1.0240249 -0.2545874 -0.0000406 0.1114594 -0.095986 -0.0000047 0.0000059 -0.0000093 -0.0185396 1.8151894 0.2805053 0.0000419 0.24738 1.0352481 0.0001178 0.0000938 0.0001572 0.1194774 -0.3467412 0.1009326 0.0000015 0.2481225 -0.0127699 0.0000145 0.0000155 0.0000166 -0.1917435 0.1131079 0.3357398 0.0000301 -0.1872691 0.0116142 0.0000073 -0.0000203 0.0000139 -0.1264209 1.4527098 0.2930784 0.0000463 0.4236431 0.02376 -0.0000014 0.0000575 0.0000022 0.0730041 0.3864023 -0.754188 -0.0000665 -1.0956978 0.5181679 0.0000367 -0.0000968 0.0000432 0.0483745 0.5409967 0.1980285 0.0000228 0.5868896 0.5628348 0.0000318 0.0000652 0.0000277 0.3211565 0.0254994 0.0221494 -0.0120096 0.0140629 -0.0274952 -0.0933125 0.0148856 -0.1457323 -0.0368787 0.025489 0.0221615 0.0120078 0.0140587 -0.0274866 0.0932982 -0.0148826 0.1457133 -0.036888 0.0207463 -0.0134731 -0.0789343 0.0182665 0.0764631 0.0187395 -0.1270262 0.0330432 -0.0142233 0.0207785 -0.0134862 0.078927 0.01824 0.0764899 -0.0187242 0.1270206 -0.0330161 -0.0142839 0.0640193 -0.0566249 -0.0000059 -0.0921486 -0.0621643 -0.0000197 -0.0000146 -0.0000141 0.1635983 0.1052392 -0.0413411 -0.0000043 0.0116294 0.016043 -0.0000123 0.0000059 -0.0000154 0.1728255 0.3153642 -0.1403953 -0.0000132 -0.1276341 0.3307969 -0.0000039 -0.0000132 -0.0000059 0.3803947 0.0725928 0.0495857 0.0867243 -0.1184343 -0.0465649 -0.0771927 0.0185582 -0.1002253 -0.0755478 0.072596 0.0495978 -0.0867066 -0.1184354 -0.0466022 0.0771965 -0.0185768 0.1002338 -0.075518 -0.1464538 -0.0171059 -0.0000079 0.0326631 0.0794351 -0.0000036 -0.0000032 -0.0000048 0.127649 unknown
polarizability: 178.7203131|4.3307035|126.2928395|0.0020028|0.0067847|59.4533386 unknown
InChI: InChI=1S/C10H10O3/c1-13-10-4-6-2-3-8(11)7(6)5-9(10)12/h4-5,12H,2-3H2,1H3
charge 0 multiplicity 1
23 atoms
O  3.053212 0.221226 0.000127
O  -3.317358 -1.400152 -0.000201
O  2.092824 -2.257225 -0.000117
C  -1.779405 1.97265 0.000175
C  -0.623347 0.97717 0.000159
C  -3.058294 1.08524 0.000191
C  -1.08858 -0.359681 0.000045
C  -2.571369 -0.383076 0.000081
C  0.762481 1.245685 0.000199
C  -0.203184 -1.465686 -0.000061
C  1.649188 0.149026 0.000106
C  1.172888 -1.205773 -0.000028
C  3.676496 1.547479 0.000279
H  -1.739229 2.632569 0.88718
H  -1.739253 2.632508 -0.886879
H  -3.696269 1.253364 -0.886048
H  -3.696095 1.253224 0.886584
H  1.135184 2.274825 0.000286
H  -0.576974 -2.493221 -0.00015
H  3.01098 -1.875979 -0.000076
H  3.391763 2.115081 0.90613
H  3.39181 2.115266 -0.90547
H  4.760029 1.361578 0.000287
