program: Gaussian 09
title: 000233147
version: EM64L-G09RevD.01
frameworkgroup: C1[X(C9H8O2)]
method: RPBEPBE
basis: SDD
operation: Freq
keyword: #p
keyword: freq=noraman
keyword: PBEPBE/SDD
title: #p freq=noraman PBEPBE/SDD
converged: NO YES NO NO
title: Mulliken charges:
elementType: O O C C C C C C C C C H H H H H H H H
charge: -0.206705 -0.423078 -0.537039 0.366202 -0.520732 0.144038 -0.005921 -0.555394 -0.340101 0.311624 -0.349093 0.239626 0.239733 0.252612 0.253228 0.236994 0.275491 0.259508 0.359006
chargesum: 0.00000
title: Mulliken charges with hydrogens summed into heavy atoms:
elementType: O O C C C C C C C C C
charge: -0.206705 -0.064072 -0.057679 0.366202 -0.014891 0.144038 -0.005921 -0.318400 -0.064610 0.311624 -0.089585
polarizability: 1.49237940e+02 4.06344073e+00 1.09314667e+02 1.10526019e-02 -1.42706686e-02 4.84906156e+01
1716.lowfreq: -10.1956 -1.3179 -0.0008 -0.0007 0.0009 6.1584 71.3839 103.0762 184.7405
frequency: 71.3688 103.0741 184.7399 232.8752 271.8833 359.8227 402.7599 426.8031 454.8669 505.3840 521.0235 577.4911 577.5297 630.1982 712.0847 719.8862 747.5118 814.8583 845.5044 858.3217 916.8027 975.5445 996.9096 1001.8369 1020.7393 1087.5696 1125.3037 1136.7769 1160.3252 1193.4222 1202.2238 1253.0505 1268.8475 1277.2394 1308.2478 1415.7108 1433.0187 1448.7636 1457.3171 1482.5467 1604.4958 1608.5063 1632.6754 2996.6808 3019.0509 3043.2396 3076.6993 3110.8780 3152.0073 3176.8890 3575.4268
redmass: 1.8510 7.1789 3.1647 7.6366 5.1983 5.0428 1.1129 2.7005 5.2971 5.5308 3.6248 2.2877 5.3893 7.2497 2.5813 5.3649 6.3762 1.4360 1.5648 1.5842 3.7128 1.4177 2.6565 1.9687 5.0338 2.1742 1.6861 1.2121 1.3060 1.5317 1.1126 1.6420 2.2010 1.7594 2.4238 5.0360 1.1334 4.2016 1.1861 2.4120 7.5648 7.6048 10.1805 1.0597 1.0620 1.1024 1.1016 1.0919 1.0893 1.0968 1.0660
irintensity: 1.2393 1.1535 1.2952 1.3715 0.1056 7.3271 153.5130 12.5033 25.0798 8.8397 1.3649 3.2415 0.6384 13.2412 6.8515 0.3115 0.9347 3.8087 63.1561 11.3264 12.9681 0.0261 17.6939 0.5312 9.3693 45.2519 224.0969 0.4119 71.2731 3.7143 0.0039 1.6632 137.0720 59.3515 11.9228 1.6608 2.4288 11.5582 32.5481 11.2324 148.6623 346.9276 85.0096 24.7825 12.9453 7.5138 15.0279 16.9922 1.0987 6.5841 53.0372
temp: 298.150 k
press: 1.00000 atm
elementType: 8 8 6 6 6 6 6 6 6 6 6 1 1 1 1 1 1 1 1
symmnumber: 1
zpe: 383862.1 jmol-1
zpe.correction: 0.146205 hartree
zpe.thermalcorrener: 0.155153 hartree
zpe.thermalcorrenthalpy: 0.156098 hartree
zpe.thermalcorrgfe: 0.111967 hartree
zpe.sumelectzpe: -497.430190 hartree
zpe.sumelectthermal: -497.421242 hartree
zpe.sumelectthermalent: -497.420297 hartree
zpe.sumelectthermalfe: -497.464428 hartree
dipole: 2.6528 4.5854 -0.0038
dipole: 5.2975
quadrupole: -68.4239 -58.0841 -65.0620
quadrupole: -3.3254 0.0160 0.0164
quadrupole: -4.5673 5.7726 -1.2053 -3.3254 0.0160 0.0164
hfenergy: -497.576395 hartree
pointgroup: C01 [X(C9H8O2)]
dipole: 1.0485619 1.8012081 -0.0019054 debye
dipolederiv: -0.9984996 -0.2926646 -0.0011766 -0.5081639 -0.8410016 -0.00182 0.0036821 0.0029292 -0.338103 -1.6339133 -0.2220771 -0.0005434 -0.2859161 -0.1161515 -0.0003459 -0.0008322 -0.0002247 -0.4229261 -0.0067398 0.0166038 0.0000804 0.0963341 -0.0605857 -0.0003236 -0.0000612 -0.0004743 0.1541977 0.4176482 -0.0877565 0.0000335 0.0685071 0.2908588 0.0005695 -0.0017666 0.0004012 -0.0131291 -0.1067282 0.2302956 0.0012232 0.155762 -0.378999 -0.0005524 0.0027303 -0.0028008 0.108644 -1.0741949 -0.1105281 0.0001595 0.1561255 -0.3415548 0.0000133 -0.0005738 -0.0001183 -0.0250053 1.7663167 0.2351463 0.0003912 0.2028145 1.0203788 0.0015999 -0.002929 -0.0003284 0.1238807 -0.5847071 0.1038731 -0.0000428 0.3728625 -0.0237703 0.0002174 -0.0001054 -0.0000133 -0.2282299 0.4181387 0.0246174 0.0004479 -0.1595882 0.1493097 -0.0001173 0.0001306 -0.0001402 -0.0867262 1.546477 0.1969466 0.0007537 0.3205528 0.3020732 0.0001518 0.0007334 -0.0000004 0.1153446 -0.3971372 -0.1098849 -0.0000465 -0.4739759 -0.1192108 -0.000464 -0.0001022 -0.0001615 -0.188607 0.0304325 0.0140385 -0.0126066 -0.0007849 -0.0109534 -0.0920489 0.0052811 -0.1382119 -0.0302785 0.0304038 0.0144227 0.0125402 -0.0005552 -0.0110124 0.0923012 -0.0052676 0.1384856 -0.0303199 0.0235731 -0.0145626 -0.0794853 0.0145689 0.0759723 0.0195173 -0.1232485 0.0335072 -0.012994 0.02531 -0.0155484 0.0785409 0.0139375 0.0753051 -0.0189578 0.1222823 -0.0328511 -0.0133481 0.0154356 -0.0741378 -0.0000641 -0.0953074 -0.0728545 -0.0000495 0.0001925 -0.00031 0.1737197 0.0928539 -0.0600572 -0.0000591 -0.0087556 -0.0224134 -0.000004 -0.0001502 -0.0001032 0.1542035 0.0109382 0.080924 -0.0000971 0.0759604 0.0225773 0.0001432 0.0000422 0.0002304 0.1740784 0.4243923 0.0703494 -0.000049 0.0556219 0.0620321 0.0001698 -0.0000379 0.0001846 0.3855984 unknown
polarizability: 149.2596437|3.9553004|109.2929406|0.0271538|-0.0335265|48.4906379 unknown
InChI: InChI=1S/C9H8O2/c10-7-2-3-8-6(5-7)1-4-9(8)11/h2-3,5,10H,1,4H2
charge 0 multiplicity 1
19 atoms
O  -2.784061 -1.484257 0.002518
O  3.585948 0.208923 0.001417
C  -1.236305 1.884533 -0.000862
C  -0.080962 0.88777 -0.001468
C  -2.518515 1.001565 0.000343
C  -0.554364 -0.448007 -0.001771
C  -2.035325 -0.468391 -0.00485
C  1.30139 1.151214 -0.000732
C  0.343228 -1.54511 -0.000185
C  2.194137 0.048654 0.000347
C  1.724471 -1.294628 0.000779
H  -1.190102 2.543356 0.886152
H  -1.191442 2.543685 -0.887696
H  -3.157716 1.173666 -0.884087
H  -3.153636 1.169907 0.888466
H  1.683157 2.180933 -0.000448
H  -0.047953 -2.567647 -0.000458
H  2.461121 -2.102983 0.001625
H  3.838328 1.166116 0.001211
