program: Gaussian 09
title: 000233158
version: EM64L-G09RevD.01
frameworkgroup: C1[X(C14H16N2O6S2)]
method: RPBEPBE
basis: SDD
operation: Freq
keyword: #p
keyword: freq=noraman
keyword: PBEPBE/SDD
title: #p freq=noraman PBEPBE/SDD
converged: YES YES NO NO
title: Mulliken charges:
elementType: S S O O O O O O N N C C C C C C C C C C C C C C H H H H H H H H H H H H H H H H
charge: 0.946137 0.946148 -0.254405 -0.254430 -0.542685 -0.541129 -0.542631 -0.541164 -0.715254 -0.715259 -0.065290 -0.065248 -0.308199 -0.308213 0.373271 0.373272 -0.234844 -0.234820 -0.203067 -0.203138 -0.314756 -0.314782 -0.349552 -0.349548 0.211813 0.236192 0.211810 0.236184 0.285103 0.285085 0.282967 0.283006 0.259274 0.259272 0.266262 0.266273 0.330674 0.337507 0.330597 0.337565
chargesum: 0.00000
title: Mulliken charges with hydrogens summed into heavy atoms:
elementType: S S O O O O O O N N C C C C C C C C C C C C C C
charge: 0.946137 0.946148 -0.254405 -0.254430 -0.542685 -0.541129 -0.542631 -0.541164 -0.047073 -0.047097 -0.065290 -0.065248 0.139806 0.139782 0.373271 0.373272 0.050260 0.050265 0.079900 0.079869 -0.055482 -0.055510 -0.083291 -0.083275
polarizability: 3.65646044e+02 -2.96048124e-03 2.03792273e+02 -1.88916370e+01 1.78809093e-04 1.76427250e+02
1716.lowfreq: -2.8750 -0.6819 -0.0024 -0.0006 -0.0003 7.7605 11.2016 13.7861 18.1263
frequency: 11.1951 13.6244 18.1262 26.4564 40.8591 57.0423 60.8581 83.8881 99.1708 111.7168 114.4703 120.2242 122.1026 150.7169 184.0310 189.2790 195.1385 222.1236 226.6582 264.8133 264.9836 288.3344 290.5582 299.4145 338.5652 341.1442 368.8366 369.8408 397.4142 412.5287 416.8681 419.1803 433.5240 447.2293 467.4812 474.2299 494.5917 529.8087 530.0420 609.4056 615.5657 621.5386 645.5569 722.6522 723.5368 766.0543 766.8997 796.3929 796.4497 811.3505 812.4361 820.2902 820.8942 843.7269 843.7971 901.3727 908.0810 908.2106 914.7868 957.2864 957.7887 973.1739 973.4242 987.6934 987.7214 1029.8268 1043.6815 1053.8979 1054.0408 1071.3530 1071.3763 1109.9777 1119.0619 1119.2662 1175.3202 1177.4462 1209.8461 1223.1294 1236.3630 1264.5579 1291.7870 1293.3155 1365.8047 1378.8488 1387.9099 1403.2223 1413.3920 1413.7985 1455.0026 1456.3065 1475.2575 1475.4041 1534.4169 1534.4393 1587.5564 1589.5251 1602.1256 1604.3831 2967.1040 2977.8384 3036.9377 3046.9962 3154.2389 3154.3077 3159.6573 3159.7068 3173.6897 3173.8190 3180.4934 3180.5508 3362.3136 3362.3274 3529.8297 3529.8455
redmass: 7.8133 8.5283 7.1385 4.3286 3.3881 6.2155 4.9840 9.5980 6.9570 2.1038 1.5655 3.0942 4.5484 7.7656 4.1739 5.2804 6.9552 9.0777 3.7287 2.5702 2.5747 4.9758 8.2231 4.1404 6.8122 5.9899 6.7614 6.8439 7.6375 5.1241 3.0115 3.1712 3.6523 6.7069 4.7874 3.8270 4.2529 2.8593 2.8479 6.5175 6.8143 7.0326 4.4222 3.4585 3.4708 4.6126 3.5528 3.3829 3.2482 2.3528 2.4890 1.2971 1.3206 1.6012 1.5840 3.3594 4.1594 4.1236 3.2314 1.3515 1.3641 1.3613 1.3591 4.6145 4.5420 2.6551 2.3741 2.5231 2.5011 1.4674 1.4681 2.2059 1.2895 1.2873 1.1966 1.1780 1.1182 3.3468 4.0163 1.1236 1.2652 1.2705 1.3190 2.8148 5.2020 2.0628 3.9915 3.9875 1.1550 1.2551 2.1330 1.8189 1.0855 1.0855 6.5826 6.7919 7.0128 6.8350 1.0563 1.0585 1.1059 1.1052 1.0887 1.0887 1.0891 1.0891 1.0959 1.0958 1.0973 1.0973 1.0414 1.0414 1.0999 1.0999
irintensity: 0.5406 1.9496 0.9017 0.3609 2.1862 0.0999 5.9455 3.1689 1.1031 18.8539 49.7699 7.4920 1.9997 0.2002 6.3088 3.1968 8.5167 12.1435 9.2563 3.4632 2.1163 2.6888 2.2536 0.1834 0.2540 0.8357 0.3757 1.5386 124.3299 7.0531 3.6241 2.0637 9.4708 0.2350 78.1125 163.1292 121.3796 77.9893 93.4757 8.8990 0.0932 3.5273 17.2547 0.0001 0.9246 2.4054 1.9442 30.4462 18.1634 495.9117 6.8832 4.2457 18.1574 70.6251 52.9751 10.3673 65.5497 68.7047 117.8078 0.0087 1.2111 0.8719 0.0010 1.1159 0.6940 29.1905 19.6984 89.5478 4.8758 30.5977 30.7481 3.2305 17.6673 3.4914 186.6725 20.7589 14.6351 674.7869 51.5867 6.0982 6.0002 1.1783 21.4707 2.4176 24.0890 11.2007 15.7012 2.3233 2.5302 222.5254 10.7070 81.5608 32.7978 9.5998 163.1651 0.5349 115.1186 20.8728 8.2620 55.1499 18.0037 33.6958 1.6000 1.8841 0.5561 0.5517 16.1118 6.6968 8.8219 3.4823 25.9969 27.2327 23.9044 23.8849
temp: 298.150 k
press: 1.00000 atm
elementType: 16 16 8 8 8 8 8 8 7 7 6 6 6 6 6 6 6 6 6 6 6 6 6 6 1 1 1 1 1 1 1 1 1 1 1 1 1 1 1 1
symmnumber: 1
zpe: 752178.7 jmol-1
zpe.correction: 0.286490 hartree
zpe.thermalcorrener: 0.312152 hartree
zpe.thermalcorrenthalpy: 0.313096 hartree
zpe.thermalcorrgfe: 0.226065 hartree
zpe.sumelectzpe: -1897.891394 hartree
zpe.sumelectthermal: -1897.865732 hartree
zpe.sumelectthermalent: -1897.864788 hartree
zpe.sumelectthermalfe: -1897.951818 hartree
dipole: 0.0011 0.4030 0.0035
dipole: 0.4031
quadrupole: -242.3119 -140.7179 -155.4411
quadrupole: -0.0296 -40.3163 -0.0046
quadrupole: -62.8216 38.7724 24.0492 -0.0296 -40.3163 -0.0046
hfenergy: -1898.1778836 hartree
pointgroup: C01 [X(C14H16N2O6S2)]
dipole: 0.0004669 0.1585531 0.0027133 debye
polarizability: 365.0789312|0.1750129|203.7903133|-21.5371791|0.2291772|176.9963225 unknown
InChI: InChI=1S/C14H16N2O6S2/c15-23(17,18)13-5-1-11(2-6-13)21-9-10-22-12-3-7-14(8-4-12)24(16,19)20/h1-8H,9-10,15-16H2
charge 0 multiplicity 1
40 atoms
S  7.249919 -0.65507 -0.097569
S  -7.249971 -0.656262 0.085892
O  1.376479 0.597781 0.560626
O  -1.376484 0.607435 -0.550505
O  7.978948 0.660116 -0.728326
O  7.735111 -1.37964 1.278313
O  -7.979334 0.648311 0.737932
O  -7.735027 -1.358538 -1.301544
N  7.29933 -1.977349 -1.38335
N  -7.2989 -1.999759 1.349492
C  5.427915 -0.259452 0.065459
C  -5.42798 -0.257697 -0.070462
C  0.735835 1.700286 -0.172844
C  -0.735642 1.697275 0.201477
C  2.736982 0.36657 0.341036
C  -2.737065 0.372764 -0.335068
C  4.918187 0.824052 -0.662751
C  -4.918347 0.813304 0.676071
C  4.646223 -1.041079 0.937103
C  -4.646261 -1.024489 -0.95517
C  3.550551 1.144471 -0.523798
C  -3.55067 1.135965 0.542748
C  3.285361 -0.720391 1.072394
C  -3.28539 -0.701578 -1.084872
H  1.196639 2.664442 0.124691
H  0.850248 1.556783 -1.264957
H  -1.196269 2.666387 -0.079766
H  -0.850076 1.535386 1.291013
H  5.578967 1.418208 -1.302128
H  -5.579225 1.396472 1.325375
H  5.096993 -1.859037 1.507279
H  -5.097009 -1.832666 -1.539136
H  3.143449 1.990882 -1.083106
H  -3.143516 1.972691 1.116384
H  2.630042 -1.291812 1.735457
H  -2.629986 -1.261646 -1.75746
H  7.747115 -1.587293 -2.229713
H  7.819244 -2.776368 -0.982348
H  -7.744879 -1.623631 2.20308
H  -7.820305 -2.791326 0.935851
