program: Gaussian 09
title: 000233140
version: EM64L-G09RevD.01
frameworkgroup: C1[X(C11H9ClN2O)]
method: RPBEPBE
basis: SDD
operation: Freq
keyword: #p
keyword: freq=noraman
keyword: PBEPBE/SDD
title: #p freq=noraman PBEPBE/SDD
converged: YES YES NO NO
title: Mulliken charges:
elementType: Cl O N N C C C C C C C C C C C H H H H H H H H H
charge: -0.036523 -0.241393 -0.430762 -0.020536 0.092318 0.087118 -0.282440 0.446454 0.158168 -0.755004 -0.321826 -0.353572 -0.221114 -0.235306 -0.220506 0.264135 0.249945 0.251392 0.232440 0.341686 0.252299 0.262445 0.239419 0.241162
chargesum: 0.00000
title: Mulliken charges with hydrogens summed into heavy atoms:
elementType: Cl O N N C C C C C C C C C C C
charge: -0.036523 -0.241393 -0.089077 -0.020536 0.092318 0.087118 -0.018304 0.446454 0.158168 -0.021227 -0.321826 -0.101272 0.041332 0.004112 0.020657
polarizability: 2.22640303e+02 -5.35927256e+00 1.32062171e+02 -1.57635684e+01 -7.26405206e-03 9.37735686e+01
1716.lowfreq: -11.8491 -8.8523 -3.5841 -0.0014 0.0008 0.0011 38.3699 51.9481 78.0994
frequency: 38.3536 51.9251 78.0860 119.1009 138.2187 167.7585 185.4181 241.1001 248.2898 273.7112 309.2672 335.2634 363.5685 426.0679 456.6348 498.1071 518.5334 568.5382 588.8579 621.6387 637.7124 663.4657 702.9624 736.3940 748.1445 760.1234 779.3181 850.2925 871.5323 910.3240 943.7504 955.5702 989.9984 1008.3409 1023.7988 1040.3809 1042.6420 1051.0582 1125.9757 1174.9177 1186.5948 1238.0808 1250.3799 1276.0127 1338.6189 1362.7755 1387.5696 1406.5938 1420.4395 1452.2198 1462.3771 1464.7559 1518.1345 1563.5140 1599.7985 1633.0943 1674.9153 2987.5882 3060.7712 3070.0765 3105.8200 3135.5793 3147.9169 3164.2427 3177.8097 3621.2975
redmass: 6.6105 6.3004 5.1009 4.5037 3.4731 1.2477 7.0725 5.3736 6.5805 3.4819 3.5800 6.1420 5.8042 4.7064 3.5849 4.4462 4.8963 6.0862 1.1330 5.7481 6.5336 6.1167 4.7637 3.7181 3.3079 2.2378 2.8510 4.3644 1.4358 1.7079 2.1506 1.4748 1.3350 4.0718 5.4904 1.8237 1.7477 3.1360 1.6660 1.0618 4.8991 2.6035 1.4971 2.0755 1.5516 5.6408 1.5334 1.7575 2.2285 1.2027 1.5390 1.6550 3.0710 5.9239 6.8263 9.6745 9.5619 1.0369 1.0868 1.0975 1.0990 1.0871 1.0899 1.0949 1.1002 1.0817
irintensity: 0.7400 0.1469 0.5454 0.2381 0.6636 0.2955 2.3727 0.7182 0.1636 5.7749 0.6119 2.5744 10.0875 4.9584 8.4070 3.0853 16.3399 11.9144 142.9322 5.7496 0.3710 13.7506 3.1463 31.2250 13.6453 71.1000 29.5951 3.5362 0.6018 17.8694 25.6108 4.7271 0.1236 12.6144 34.4062 0.0710 13.4977 33.3299 1.2384 0.2923 85.3471 18.8696 4.5532 6.1541 25.4255 1.3936 2.4463 23.0048 19.3379 14.2964 49.8188 2.3914 1.9204 6.2592 2.3643 272.9955 89.2758 13.5601 0.3136 9.3358 10.1287 1.1109 5.8453 11.3445 14.1104 70.5713
temp: 298.150 k
press: 1.00000 atm
elementType: 17 8 7 7 6 6 6 6 6 6 6 6 6 6 6 1 1 1 1 1 1 1 1 1
symmnumber: 1
zpe: 460275.9 jmol-1
zpe.correction: 0.175310 hartree
zpe.thermalcorrener: 0.188607 hartree
zpe.thermalcorrenthalpy: 0.189551 hartree
zpe.thermalcorrgfe: 0.134447 hartree
zpe.sumelectzpe: -1068.274808 hartree
zpe.sumelectthermal: -1068.261511 hartree
zpe.sumelectthermalent: -1068.260567 hartree
zpe.sumelectthermalfe: -1068.315670 hartree
dipole: -4.1516 0.0442 2.3088
dipole: 4.7506
quadrupole: -82.9487 -94.3255 -98.8310
quadrupole: -5.6952 -0.1534 5.2397
quadrupole: 9.0863 -2.2904 -6.7960 -5.6952 -0.1534 5.2397
hfenergy: -1068.4501177 hartree
pointgroup: C01 [X(C11H9Cl1N2O1)]
dipole: 1.6461153 0.8590029 0.2137452 debye
dipolederiv: -0.1900833 -0.0902449 -0.2211063 -0.0567045 -0.1494014 -0.1853723 -0.1791347 -0.1768176 -0.5199155 -0.6276533 -0.1422781 0.1084913 -0.4636483 -0.8059252 0.348857 0.3614328 0.3675772 -0.604292 -0.2551673 0.271898 -0.2131692 -0.365107 -0.7478745 0.2846802 0.2857251 0.3479912 -0.5689247 0.0537372 0.2509435 -0.1723488 0.687095 0.0498691 -0.1457089 -0.5046772 -0.1639254 -0.0922247 -0.8877131 0.0073361 -0.0119223 -0.187551 -0.1047407 0.106675 -0.0167574 0.1085293 -0.0354953 0.0317414 0.0023409 0.0178759 0.0134408 0.3125366 -0.1944666 0.008891 -0.2294211 0.164117 0.5474507 -0.0869481 0.0163438 0.094529 0.0557089 -0.1254353 0.0703765 -0.1190101 0.0317239 0.0115361 -0.0304441 -0.0710829 -0.1075601 -0.038088 -0.0609756 -0.105429 -0.0492533 -0.2036861 1.0372213 -0.2622572 0.2082799 0.3600988 0.8850426 -0.5216421 -0.277363 -0.5526661 0.6372594 -0.1035372 -0.0677797 0.0640553 -0.0213766 -0.0552142 0.0505757 0.0263359 0.053446 -0.0073377 0.2113635 0.1915973 0.3747001 0.2344752 0.0869653 0.3144906 0.1205472 0.312483 0.7252432 -0.0327944 0.0436814 -0.0268219 -0.0802003 -0.1148061 0.0419012 0.1105809 0.0138597 0.0817684 -0.180284 -0.0551002 -0.1659914 -0.0749847 -0.1251833 -0.051253 -0.1357503 -0.0499474 -0.1205936 -0.1034075 0.0485592 0.0899891 0.0909726 -0.1293573 0.0640782 0.099701 0.0508277 0.0211761 0.0728201 0.0578063 -0.0420004 0.0570643 -0.1173328 0.0285174 0.0013752 0.0400494 0.043661 0.0134608 -0.029221 0.0186748 0.0525223 0.0703016 0.0568498 0.0564808 0.062771 0.0544504 0.0342018 0.1121382 -0.0662396 0.0435271 -0.0255095 0.0854266 -0.0237184 0.0790749 0.0771191 0.0252118 -0.0116898 0.0942331 -0.018076 0.0721301 -0.0793037 0.0953794 -0.0258299 0.0292489 0.0216487 -0.0835099 -0.0601335 -0.0861735 0.0704379 -0.0066077 -0.0771427 -0.0575086 -0.020477 0.2582351 -0.0089719 0.0023475 -0.0195911 0.2281191 0.107372 0.0134354 0.1044771 0.2912458 0.0737343 -0.01874 0.080314 -0.0176023 0.1411506 -0.0170896 0.0705491 -0.0250957 -0.0302389 0.0668708 -0.0067329 0.0415473 -0.0226184 0.1530658 -0.031888 0.0711061 -0.024575 -0.0057101 0.0137575 -0.0382032 -0.0753868 -0.0471234 0.1424414 -0.0579565 -0.0910712 -0.0533475 -0.0302138 -0.0923509 -0.0541798 0.0093513 -0.0654081 0.1456637 -0.0117246 0.0191274 -0.0136888 0.0820964 unknown
polarizability: 222.8899066|12.2768446|94.7545278|9.3261639|-7.2935041|130.8316078 unknown
InChI: InChI=1S/C11H9ClN2O/c1-7-9(11(15)14-13-7)6-8-4-2-3-5-10(8)12/h2-6,14H,1H3
charge 0 multiplicity 1
24 atoms
Cl 0.993808 -1.028778 -2.164609
O  -3.084834 -1.562643 1.295924
N  -3.607652 0.241108 -0.178159
N  -2.933521 1.260417 -0.897309
C  -1.377998 -0.067881 0.200703
C  -1.619076 1.079979 -0.694597
C  -0.266216 -0.627886 0.769902
C  1.16449 -0.306582 0.563397
C  -2.758476 -0.600373 0.547216
C  -0.632085 2.041935 -1.28867
C  1.850865 -0.406389 -0.675935
C  1.942354 0.064475 1.700124
C  3.222196 -0.11006 -0.8046
C  3.311001 0.379525 1.590092
C  3.953121 0.299056 0.332497
H  -0.480189 -1.410923 1.517306
H  -1.176114 2.872588 -1.767121
H  0.001765 1.55194 -2.048656
H  0.039179 2.455385 -0.513571
H  -4.624265 0.212766 -0.205107
H  1.443567 0.120572 2.674307
H  3.710273 -0.211273 -1.778153
H  3.874706 0.678749 2.479443
H  5.017903 0.534292 0.234674
