program: Gaussian 09
title: 000233138
version: EM64L-G09RevD.01
frameworkgroup: C1[X(C12H18N6)]
method: RPBEPBE
basis: SDD
operation: Freq
keyword: #pfreq=noraman
keyword: PBEPBE/SDD
title: #p freq=noraman PBEPBE/SDD
converged: NO YES NO NO
title: Mulliken charges:
elementType: N N N N N N C C C C C C C C C C C C H H H H H H H H H H H H H H H H H H
charge: -0.362787 -0.042175 -0.080620 0.021829 -0.044461 -0.327310 -0.144567 0.164824 -0.081080 0.099229 0.102611 -0.052701 -0.304433 -0.298158 -0.780907 -0.773776 -0.713962 -0.719357 0.340923 0.231206 0.231247 0.328697 0.226695 0.227043 0.244261 0.226900 0.226917 0.223316 0.262937 0.223291 0.222724 0.222721 0.227829 0.222622 0.222324 0.226150
chargesum: 0.00000
title: Mulliken charges with hydrogens summed into heavy atoms:
elementType: N N N N N N C C C C C C C C C C C C
charge: -0.021864 -0.042175 -0.080620 0.021829 -0.044461 0.001387 -0.144567 0.164824 -0.081080 0.099229 0.102611 -0.052701 0.158019 0.155580 -0.082829 -0.064231 -0.040688 -0.048262
polarizability: 2.94608854e+02 1.48713520e-01 1.99349267e+02 -5.94938786e-02 1.70220495e-02 9.59051673e+01
1716.lowfreq: -18.5839 -0.0010 -0.0008 -0.0005 2.9174 5.6445 8.7180 23.4275 50.7802
frequency: -17.5951 23.2329 50.7687 71.1505 79.3775 96.2003 104.5528 109.1698 144.0775 171.1424 199.2601 208.4524 241.7655 257.3782 258.9927 277.7742 294.3586 296.8078 298.5630 345.2442 374.0719 398.0530 477.1954 486.5490 527.3343 545.2991 562.1347 609.6561 621.2267 636.7359 689.7106 697.3100 732.4468 737.6261 741.6023 794.0832 794.5762 812.5632 817.0470 901.3367 913.8032 969.0927 1005.8399 1022.9370 1028.8691 1050.1786 1053.9021 1065.8990 1116.9802 1144.0104 1144.7423 1153.4998 1169.5633 1178.6974 1235.5754 1256.7096 1260.8865 1283.0524 1288.9903 1337.5258 1340.9107 1360.0590 1374.1272 1385.2688 1397.2885 1397.6360 1398.8441 1417.3335 1429.3959 1443.9161 1453.6968 1459.3540 1473.1047 1476.2788 1476.8922 1477.1517 1479.4787 1481.9315 1496.0148 1498.7768 1516.6286 1537.0861 1559.8026 1587.0052 2973.7317 2977.6348 2981.9492 2983.1773 2983.6643 2985.4233 3022.9658 3024.7536 3046.0028 3051.6274 3076.9278 3078.6875 3090.9258 3092.8022 3107.4443 3122.0159 3498.9772 3560.8841
redmass: 2.1233 2.2610 3.2791 2.9347 3.3694 1.3001 1.7024 3.6194 2.3842 1.3358 2.5641 3.2773 3.7278 1.5352 1.2834 2.9586 4.4271 3.1148 3.2560 3.8431 4.7821 3.5489 9.2268 6.3896 4.4458 1.1451 5.3992 8.5510 3.0186 1.2863 6.3839 6.7302 7.0936 7.6836 4.3647 1.1133 1.1035 6.1082 10.3908 2.2466 1.8669 1.8210 1.9845 1.4069 2.9883 3.4128 1.6688 2.6185 3.9481 1.5275 1.5216 3.1947 4.0254 3.2568 3.2780 1.1014 1.0996 2.8651 4.2066 1.5907 2.5149 2.6408 4.3972 1.3232 1.2457 1.2394 1.2661 2.6269 2.3708 1.2485 2.2515 1.0474 1.0457 1.3447 1.0401 1.0404 1.0619 1.0911 1.0993 1.0789 3.5046 4.7228 5.5825 7.3429 1.0383 1.0388 1.0395 1.0559 1.0397 1.0560 1.1036 1.1034 1.0969 1.0965 1.1011 1.1010 1.0985 1.0986 1.0978 1.0979 1.0769 1.0770
irintensity: 0.0009 0.1402 2.2278 5.8097 0.5007 0.3491 0.2425 1.1378 0.2338 0.7069 0.6234 2.7292 0.0494 0.0030 0.0327 0.2121 3.1694 1.0277 1.6073 10.1831 2.2188 0.8610 8.3588 5.0976 2.3581 98.0265 4.9611 0.5240 7.0415 63.7578 12.3973 0.1885 2.0384 21.5427 0.0548 0.0468 9.1510 7.2271 7.5348 11.5407 1.5061 23.9435 1.7551 7.4157 14.0679 2.1278 0.0354 2.7590 0.3985 0.2734 3.3933 0.2779 13.1225 51.3487 10.8509 0.0762 0.0179 93.7752 0.5979 21.4283 19.1135 208.3641 49.1738 16.7563 47.6517 11.2377 29.3268 19.1733 115.0305 59.2828 45.1406 0.1182 36.9442 61.2325 8.7889 15.5508 29.9201 42.3647 79.2909 14.4949 227.5448 194.4998 950.0088 397.6753 42.4970 22.4677 39.2854 10.6084 42.3391 42.6505 13.3104 15.1923 25.3514 13.3327 47.8389 53.6110 32.6735 36.1933 12.4805 8.0118 52.6029 81.5963
temp: 298.150 k
press: 1.00000 atm
elementType: 7 7 7 7 7 7 6 6 6 6 6 6 6 6 6 6 6 6 1 1 1 1 1 1 1 1 1 1 1 1 1 1 1 1 1 1
symmnumber: 1
zpe: 776036.4 jmol-1
zpe.correction: 0.295577 hartree
zpe.thermalcorrener: 0.313456 hartree
zpe.thermalcorrenthalpy: 0.314400 hartree
zpe.thermalcorrgfe: 0.249124 hartree
zpe.sumelectzpe: -795.274141 hartree
zpe.sumelectthermal: -795.256262 hartree
zpe.sumelectthermalent: -795.255318 hartree
zpe.sumelectthermalfe: -795.320594 hartree
dipole: 0.5969 3.5389 0.0013
dipole: 3.5889
quadrupole: -81.5638 -104.2704 -108.5307
quadrupole: -3.3008 -0.0079 0.0047
quadrupole: 16.5578 -6.1488 -10.4090 -3.3008 -0.0079 0.0047
hfenergy: -795.569718 hartree
pointgroup: C01 [X(C12H18N6)]
dipole: -0.260858 1.3876585 -0.0033046 debye
polarizability: 294.5810516|1.6344146|199.3766327|0.0224062|-0.2166894|95.9056038 unknown
InChI: InChI=1S/C12H18N6/c1-5-13-10-9-11(16-8(4)7(3)15-9)18-12(17-10)14-6-2/h13-14H,5-6H2,1-4H3
charge 0 multiplicity 1
36 atoms
N  -0.499226 2.350756 -0.01215
N  1.916795 0.966431 -0.008606
N  -1.71398 0.326871 -0.007461
N  1.862137 -1.896342 -0.002461
N  -0.518096 -1.848131 -0.002696
N  -2.839273 -1.729912 -0.003316
C  0.736728 0.267231 -0.00726
C  -0.530744 0.987949 -0.008982
C  0.674591 -1.17075 -0.004095
C  3.068308 0.251969 -0.006918
C  3.023201 -1.200937 -0.003868
C  -1.640483 -1.060534 -0.004488
C  -1.700931 3.196153 -0.014062
C  -4.157423 -1.081079 -0.004252
C  4.375896 1.008881 -0.008316
C  4.30255 -2.008559 -0.002264
C  -1.311916 4.683687 -0.017381
C  -5.272175 -2.140718 -0.010469
H  0.438834 2.765188 -0.013041
H  -2.318958 2.949397 -0.89901
H  -2.319003 2.95331 0.87193
H  -2.767148 -2.74886 -0.000664
H  -4.249138 -0.425942 0.883486
H  -4.244331 -0.42028 -0.888131
H  4.170446 2.090947 -0.010231
H  4.989893 0.76654 0.880395
H  4.989835 0.763426 -0.896221
H  4.922846 -1.782198 0.886213
H  4.049726 -3.07926 -0.000378
H  4.923035 -1.785324 -0.891396
H  -0.719251 4.944465 0.879068
H  -0.719206 4.940447 -0.91496
H  -2.21801 5.313884 -0.018818
H  -5.210644 -2.781773 -0.909612
H  -5.214801 -2.788155 0.884415
H  -6.261684 -1.651576 -0.0109
