program: Gaussian 09
title: 000233128
version: EM64L-G09RevD.01
frameworkgroup: C1[X(C20H23NO3)]
method: RPBEPBE
basis: SDD
operation: Freq
keyword: #p
keyword: freq=noraman
keyword: PBEPBE/SDD
title: #p freq=noraman PBEPBE/SDD
converged: YES YES NO NO
title: Mulliken charges:
elementType: O O O N C C C C C C C C C C C C C C C C C C C C H H H H H H H H H H H H H H H H H H H H H H H
charge: -0.275894 -0.294365 -0.302432 -0.362926 -0.333316 0.365839 0.313639 -0.363504 0.104454 0.110312 -0.369543 -0.350693 -0.312205 -0.355000 -0.378052 -0.371300 -0.358703 -0.359150 0.287563 -0.261784 -0.259277 -0.219479 -0.217400 -0.694519 0.287235 0.186352 0.196901 0.223538 0.205952 0.189028 0.192881 0.325131 0.234204 0.219242 0.196761 0.194489 0.275086 0.248534 0.258245 0.259693 0.230235 0.231532 0.232260 0.233624 0.216170 0.209829 0.210813
chargesum: 0.00000
title: Mulliken charges with hydrogens summed into heavy atoms:
elementType: O O O N C C C C C C C C C C C C C C C C C C C C
charge: -0.275894 -0.294365 -0.302432 -0.037795 -0.046081 0.365839 0.313639 0.019749 0.104454 0.110312 0.059947 0.031215 0.141241 0.036250 -0.102966 -0.122766 -0.100458 -0.099457 0.287563 -0.031550 -0.027745 0.012780 0.016224 -0.057707
polarizability: 2.90841756e+02 2.56789389e+01 2.61654990e+02 3.23961700e+01 -8.93559941e+00 1.49992318e+02
1716.lowfreq: -8.2309 -0.0004 0.0004 0.0007 3.2044 4.3285 9.6537 14.1959 28.7948
frequency: 6.9196 14.1274 28.7536 41.5984 45.6547 55.5607 68.2820 76.5403 104.6359 114.6312 119.6637 127.3390 158.9334 191.5036 213.8520 225.8766 237.3776 249.3051 264.9782 298.1919 302.7112 343.1872 372.5930 398.5236 416.6460 418.8220 463.5885 488.4093 518.6605 519.7653 550.4728 576.0677 591.6111 593.7817 616.8070 643.6391 665.0228 697.3231 717.0314 726.9992 727.6844 748.0476 753.9498 766.5313 768.5893 797.5022 823.4273 838.2372 866.3734 870.9581 886.4941 887.0090 891.4102 915.3669 950.8690 958.3074 979.6494 984.8893 987.5590 991.6140 1008.9966 1030.2622 1032.6556 1037.7926 1064.9435 1076.3072 1081.2521 1090.6812 1113.0118 1120.9280 1166.3982 1168.2243 1169.2745 1174.3221 1187.6222 1203.3023 1206.3497 1211.7743 1222.2459 1235.6647 1241.4563 1253.6152 1281.4280 1284.9326 1289.4158 1291.5274 1297.3741 1315.4927 1333.8719 1340.4379 1355.5452 1371.4441 1389.1272 1390.7120 1392.4927 1443.3196 1447.2560 1452.3094 1464.0508 1466.2063 1466.9756 1473.8523 1474.3581 1476.7099 1481.6712 1482.8119 1489.2862 1581.8129 1602.1042 1611.7293 1631.8490 1643.0536 2954.0506 2958.4285 2968.5473 2972.7787 2987.7492 2991.4794 3007.6603 3017.3511 3020.3388 3030.7697 3050.4623 3069.2335 3072.1276 3098.0268 3129.3770 3130.9343 3141.3634 3141.5089 3158.7575 3160.4192 3172.6406 3173.9222 3557.1390
redmass: 4.2776 4.8195 4.7945 1.6622 4.8455 4.8853 4.6734 4.2355 3.2323 2.0242 3.6601 2.2912 4.4538 5.5953 5.1756 1.1309 4.3637 3.4767 5.6301 4.7230 4.6467 4.3055 6.3618 4.7638 3.2731 3.2020 3.2131 3.7392 4.1360 4.1998 2.0090 2.0036 4.2126 6.8851 5.8675 5.4876 5.6932 11.3029 4.8205 1.0813 3.8440 1.2050 3.1312 1.3078 1.2847 1.2186 4.6759 5.4766 1.4189 1.4689 1.8705 1.3857 4.0224 4.9558 1.4983 1.4090 2.2804 1.3219 1.2863 1.5967 3.8552 2.2782 2.0182 3.4413 2.8988 5.9423 2.1849 2.1734 2.1102 2.6383 1.7190 1.0926 1.1637 2.4001 2.1536 1.4714 1.9801 2.1369 1.8070 1.2777 2.5994 1.2736 1.0490 1.4503 1.1536 1.1930 1.1796 1.5171 1.4675 1.4152 1.6471 1.3403 1.2165 6.1153 10.2729 2.3901 2.3906 1.2036 1.2997 1.0784 1.3270 2.3404 1.1134 1.0431 2.3588 1.1221 1.0941 6.6038 7.5111 6.8991 7.2800 8.9468 1.0588 1.0590 1.0592 1.0363 1.0615 1.0952 1.1013 1.0834 1.0578 1.1039 1.1037 1.1007 1.0993 1.1086 1.0873 1.0870 1.0900 1.0895 1.0946 1.0945 1.0998 1.0998 1.0778
irintensity: 0.0272 0.0544 0.9315 0.3373 0.1422 3.7502 3.9479 0.6525 0.6010 0.0117 0.0209 0.0462 3.5949 0.4033 0.3910 0.0719 0.7235 2.2866 1.9198 21.2306 0.2960 10.7291 0.9425 0.4929 1.0390 4.2838 3.0067 18.7769 6.6681 0.0368 32.3993 57.2902 14.8441 4.1343 15.4049 1.0366 1.8550 17.2623 3.7879 11.3602 1.9805 0.9375 8.5176 133.8265 56.9062 1.5241 4.8214 4.5201 1.1312 1.8620 12.3441 4.8751 31.9514 25.7832 33.2453 12.0053 83.4728 1.6328 0.2249 47.0009 9.0989 0.4096 12.6026 18.3059 1.5912 79.4852 0.5464 36.4442 26.5562 15.3778 42.2200 0.6863 7.0648 2.9815 344.6846 1.0360 96.7258 1.6462 45.7946 7.0790 226.1130 2.8784 0.5717 2.9219 0.8133 2.6809 0.7231 62.3041 13.5428 1.7838 1.1705 8.6413 11.5798 3.8120 1.0866 100.5718 17.4312 39.1902 215.9506 3.3934 239.9002 132.8897 13.8748 12.8590 7.7116 4.7106 31.3140 45.8657 6.6688 24.7880 4.4820 262.9930 1.2496 9.7639 87.7383 35.4313 25.0445 3.5461 0.6593 6.8758 53.6038 32.4862 42.8116 90.2974 55.6812 31.3691 1.6158 0.5973 5.8771 11.1051 17.2426 16.5391 20.1064 13.4345 31.8951
temp: 298.150 k
press: 1.00000 atm
elementType: 8 8 8 7 6 6 6 6 6 6 6 6 6 6 6 6 6 6 6 6 6 6 6 6 1 1 1 1 1 1 1 1 1 1 1 1 1 1 1 1 1 1 1 1 1 1 1
symmnumber: 1
zpe: 1015301.5 jmol-1
zpe.correction: 0.386708 hartree
zpe.thermalcorrener: 0.409639 hartree
zpe.thermalcorrenthalpy: 0.410583 hartree
zpe.thermalcorrgfe: 0.329704 hartree
zpe.sumelectzpe: -1054.616790 hartree
zpe.sumelectthermal: -1054.593859 hartree
zpe.sumelectthermalent: -1054.592915 hartree
zpe.sumelectthermalfe: -1054.673794 hartree
dipole: 0.4466 -0.4268 -1.4443
dipole: 1.5709
quadrupole: -127.9646 -129.9485 -147.7608
quadrupole: 3.6579 1.9238 0.0781
quadrupole: 7.2601 5.2761 -12.5362 3.6579 1.9238 0.0781
hfenergy: -1055.0034978 hartree
pointgroup: C01 [X(C20H23N1O3)]
dipole: 0.2359714 0.3708841 0.4344244 debye
polarizability: 278.1580297|-44.5104904|245.1959913|-25.3297406|-46.365932|179.135043 unknown
InChI: InChI=1S/C20H23NO3/c1-2-3-4-9-14-23-20(22)21-19-15-10-5-7-12-17(15)24-18-13-8-6-11-16(18)19/h5-8,10-13,19,21H,2-4,9,14H2,1H3
charge 0 multiplicity 1
47 atoms
O  -3.65437 -0.012613 1.28915
O  2.003468 1.71169 -0.196689
O  1.26936 0.115402 -1.780665
N  -0.175337 1.07122 -0.193696
C  -1.390281 0.32404 -0.616725
C  -1.60596 -0.929756 0.231002
C  -2.601747 1.247536 -0.573191
C  5.61386 0.326601 -0.353874
C  -2.67659 -1.026037 1.150214
C  -3.63935 1.060562 0.372124
C  4.133624 0.447133 0.078348
C  6.375012 -0.765659 0.431588
C  3.399018 1.550514 -0.694088
C  7.85684 -0.899079 0.012881
C  -0.707655 -2.022733 0.14123
C  -2.703664 2.348518 -1.459451
C  -2.844995 -2.152613 1.984229
C  -4.736732 1.946808 0.454954
C  1.041658 0.887791 -0.808235
C  -0.862697 -3.160686 0.958301
C  -3.793527 3.239362 -1.399052
C  -1.931442 -3.220039 1.888347
C  -4.810635 3.037639 -0.431551
C  8.60899 -1.988649 0.807489
H  -1.175894 0.019614 -1.658255
H  6.124828 1.301884 -0.210104
H  5.667302 0.100482 -1.439043
H  3.617063 -0.516978 -0.091713
H  4.077496 0.66515 1.16272
H  6.320714 -0.541771 1.517509
H  5.865654 -1.741463 0.289407
H  -0.221517 1.681737 0.62409
H  3.366329 1.326337 -1.775614
H  3.855701 2.540169 -0.524306
H  7.910215 -1.126583 -1.071391
H  8.364373 0.077582 0.151171
H  0.118771 -1.960577 -0.576477
H  -1.904022 2.504959 -2.193173
H  -3.687958 -2.174851 2.681238
H  -5.510478 1.759901 1.2054
H  -0.159421 -3.995562 0.874484
H  -3.853169 4.083212 -2.09382
H  -2.056348 -4.09893 2.529957
H  -5.660411 3.726211 -0.37377
H  9.666029 -2.063523 0.492449
H  8.594078 -1.769441 1.891942
H  8.141511 -2.980612 0.660258
