program: Gaussian 09
title: 000233119
version: EM64L-G09RevD.01
frameworkgroup: C1[X(C16H14ClNO3)]
method: RPBEPBE
basis: SDD
operation: Freq
keyword: #p
keyword: freq=noraman
keyword: PBEPBE/SDD
title: #p freq=noraman PBEPBE/SDD
converged: YES YES NO NO
title: Mulliken charges:
elementType: Cl O O O N C C C C C C C C C C C C C C C C H H H H H H H H H H H H H H
charge: -0.056810 -0.274471 -0.298826 -0.288491 -0.355888 -0.313289 0.344261 0.327226 0.096859 0.098733 -0.358034 -0.361396 -0.356493 -0.356328 -0.262678 -0.261155 -0.220282 -0.219392 0.303093 -0.245535 -0.542081 0.287713 0.323077 0.261531 0.248424 0.259067 0.259966 0.232970 0.231069 0.233081 0.233563 0.226230 0.270916 0.258351 0.275020
chargesum: 0.00000
title: Mulliken charges with hydrogens summed into heavy atoms:
elementType: Cl O O O N C C C C C C C C C C C C C C C C
charge: -0.056810 -0.274471 -0.298826 -0.288491 -0.032811 -0.025576 0.344261 0.327226 0.096859 0.098733 -0.096504 -0.112972 -0.097426 -0.096362 -0.029708 -0.030086 0.012799 0.014171 0.303093 0.251611 -0.008710
polarizability: 2.34105437e+02 1.37124327e+01 2.44103885e+02 2.33715954e+01 -4.03960970e+00 1.10190839e+02
1716.lowfreq: -6.6195 -3.9298 -0.0018 -0.0014 0.0004 2.9414 10.9317 19.9678 23.5569
frequency: 8.9015 19.9224 23.5117 42.9790 64.3512 76.3417 113.4133 122.8751 163.0555 194.2747 223.1248 244.8500 255.8530 297.9095 304.5859 329.9400 370.4282 403.9332 405.3035 449.8950 460.3444 509.7091 520.5947 556.3081 571.9006 595.3775 596.6216 607.8357 620.5282 649.5618 668.1789 692.0178 712.2762 724.5560 753.5874 766.7261 767.8984 808.5616 830.4778 860.6142 867.5881 872.5134 892.1339 926.2705 950.9530 954.3616 975.8997 984.0558 985.7390 997.7874 1031.3434 1034.3106 1055.6900 1090.7135 1091.4623 1116.8162 1168.3735 1169.5648 1174.6790 1180.1385 1188.4435 1208.2055 1213.8030 1229.0562 1231.2924 1243.4020 1284.4939 1300.7691 1318.9754 1324.4861 1359.1983 1389.9386 1393.5114 1430.9863 1441.3457 1447.3015 1454.0052 1471.8410 1475.0153 1483.2659 1581.8618 1603.1598 1612.2867 1632.7924 1668.6132 3003.2272 3004.4855 3056.2372 3079.6148 3129.6342 3131.7918 3141.8753 3141.9884 3142.0960 3159.8571 3160.8431 3173.6246 3174.0432 3556.7892
redmass: 8.4119 8.1754 5.0914 10.0834 10.6530 4.7117 3.9643 3.9314 6.3467 6.2563 4.7265 4.8108 5.1909 5.0075 4.2947 3.4228 6.6478 4.7167 3.7745 2.8974 3.1923 3.6335 3.9977 3.0407 4.4850 4.6800 1.9851 4.6191 3.7873 6.8610 6.1451 10.9504 4.3114 3.8729 3.4799 1.3306 1.3809 3.7579 4.8076 1.8220 1.4675 2.0544 5.5368 2.4405 1.5108 1.4049 3.0221 1.3319 1.3430 2.1541 2.2663 1.9984 2.8871 3.6018 2.2870 2.2022 1.0792 1.1492 2.5438 1.5896 1.6151 2.0727 2.6680 1.7666 1.1507 2.0982 1.4508 1.1813 1.3117 1.6204 1.2959 6.9109 10.4132 1.1020 2.4800 2.4628 1.1191 1.7904 2.5411 2.4957 6.6787 7.5532 6.8444 7.2674 9.5973 1.0611 1.0806 1.0594 1.1028 1.0871 1.0874 1.0894 1.1092 1.0902 1.0944 1.0944 1.0999 1.1000 1.0777
irintensity: 1.3233 0.5540 0.8020 1.6392 4.6224 3.9078 0.1492 1.6660 0.8335 1.3605 2.2710 7.8567 0.0944 0.9355 0.9876 27.9155 0.4580 0.1235 6.0154 14.4497 4.4327 16.7952 0.0346 13.0943 13.5617 21.2074 33.3771 18.8031 37.2447 1.3860 3.2811 19.3394 5.6651 1.4743 22.5240 45.5518 126.4038 2.7848 3.0860 9.6527 1.1794 9.1044 37.4664 9.5457 30.5768 6.2954 75.7614 0.4654 0.3797 89.8891 0.4391 12.1599 3.4541 105.1584 51.9443 49.0436 3.8120 20.1164 12.3115 120.5030 139.6047 91.1939 7.7483 46.2717 3.3372 215.0195 0.3278 12.2752 67.9573 6.7551 1.6178 6.7906 0.8794 10.8147 123.5201 5.6117 25.5984 406.5278 144.6740 15.9167 47.7549 9.4169 25.8477 0.7178 301.6101 48.5741 1.3805 29.2780 3.7271 1.3319 0.1061 9.1449 13.5765 8.1358 18.7739 13.4362 25.4147 7.1319 32.3691
temp: 298.150 k
press: 1.00000 atm
elementType: 17 8 8 8 7 6 6 6 6 6 6 6 6 6 6 6 6 6 6 6 6 1 1 1 1 1 1 1 1 1 1 1 1 1 1
symmnumber: 1
zpe: 699538.3 jmol-1
zpe.correction: 0.266440 hartree
zpe.thermalcorrener: 0.284616 hartree
zpe.thermalcorrenthalpy: 0.285560 hartree
zpe.thermalcorrgfe: 0.215893 hartree
zpe.sumelectzpe: -1357.111614 hartree
zpe.sumelectthermal: -1357.093438 hartree
zpe.sumelectthermalent: -1357.092494 hartree
zpe.sumelectthermalfe: -1357.162161 hartree
dipole: 0.4758 -1.8659 -2.3075
dipole: 3.0054
quadrupole: -113.2604 -113.3226 -134.3318
quadrupole: -6.6802 -3.2601 2.2513
quadrupole: 7.0446 6.9823 -14.0269 -6.6802 -3.2601 2.2513
hfenergy: -1357.378054 hartree
pointgroup: C01 [X(C16H14Cl1N1O3)]
dipole: 0.4284217 -0.7454402 -0.8116977 debye
polarizability: 224.3877799|12.2747141|249.4679238|29.9445625|-10.862791|114.544457 unknown
InChI: InChI=1S/C16H14ClNO3/c17-9-10-20-16(19)18-15-11-5-1-3-7-13(11)21-14-8-4-2-6-12(14)15/h1-8,15,18H,9-10H2
charge 0 multiplicity 1
35 atoms
Cl 4.628962 2.047175 -0.091479
O  -2.920486 0.267792 -0.667905
O  3.243397 -0.889713 -0.293705
O  2.360975 -0.425774 1.856183
N  1.004645 -0.587981 -0.055688
C  -0.276812 -0.269147 0.622852
C  -0.772061 1.125059 0.236799
C  -1.322339 -1.344464 0.339656
C  -2.026471 1.326066 -0.385219
C  -2.556031 -1.040317 -0.283797
C  0.035311 2.263364 0.484968
C  -1.076458 -2.693717 0.696021
C  -2.472401 2.611803 -0.762738
C  -3.515149 -2.040649 -0.559277
C  -0.393116 3.555155 0.121064
C  -2.021286 -3.705523 0.434947
C  -1.652171 3.727201 -0.508175
C  -3.245515 -3.374234 -0.199474
C  2.196988 -0.606771 0.622141
C  4.613345 -0.754174 0.234839
C  5.345055 0.352436 -0.51018
H  -0.015795 -0.276107 1.69891
H  1.019566 -0.697497 -1.071358
H  1.010682 2.122457 0.965229
H  -0.123622 -2.941436 1.178487
H  -3.449738 2.711668 -1.244094
H  -4.451556 -1.75234 -1.045944
H  0.245658 4.420982 0.322328
H  -1.81131 -4.740996 0.721485
H  -1.992365 4.727396 -0.797026
H  -3.986755 -4.152822 -0.408965
H  5.123034 -1.717344 0.041641
H  4.569356 -0.568341 1.322518
H  6.405981 0.391505 -0.216625
H  5.244086 0.250986 -1.600522
