program: Gaussian 09
title: 000233111
version: EM64L-G09RevD.01
frameworkgroup: C1[X(C10H10N2O3)]
method: RPBEPBE
basis: SDD
operation: Freq
keyword: #p
keyword: freq=noraman
keyword: PBEPBE/SDD
title: #p freq=noraman PBEPBE/SDD
converged: YES YES NO NO
title: Mulliken charges:
elementType: O O O N N C C C C C C C C C C H H H H H H H H H H
charge: -0.214028 -0.232157 -0.429583 -0.394201 -0.398887 -0.158885 -0.573919 0.491962 0.173469 0.186062 -0.372937 -0.401094 -0.383776 -0.346847 0.280790 0.276098 0.248302 0.225613 0.349458 0.352006 0.238331 0.249395 0.222566 0.256004 0.356260
chargesum: 0.00000
title: Mulliken charges with hydrogens summed into heavy atoms:
elementType: O O O N N C C C C C C C C C C
charge: -0.214028 -0.232157 -0.073323 -0.044743 -0.046882 0.117213 -0.100004 0.491962 0.173469 0.186062 -0.134606 -0.151699 -0.161210 -0.090843 0.280790
polarizability: 1.74047113e+02 3.93755989e+00 1.31605837e+02 -1.59790605e+01 1.18230937e+01 7.83747119e+01
1716.lowfreq: -9.3383 -1.2490 -0.0007 -0.0004 0.0004 5.0787 32.5250 37.2189 57.6982
frequency: 32.4434 37.0532 57.6876 96.2748 148.4690 161.1974 182.2174 290.5444 329.7964 358.7671 377.4408 402.6972 411.4115 431.0409 472.6361 493.9698 523.3760 574.1549 602.1304 619.8026 636.3317 660.4318 689.5579 715.5768 724.6349 760.9489 807.3652 826.2983 830.6704 866.7180 931.3631 938.2028 958.0427 965.2777 1003.9282 1013.2855 1084.7191 1106.1086 1143.8143 1175.2148 1180.9884 1182.9827 1216.3723 1226.9996 1250.9761 1293.2021 1307.5801 1313.4462 1325.7371 1338.2769 1369.4034 1391.7989 1427.6214 1465.7798 1505.5291 1595.5785 1627.2324 1682.3923 1724.7161 2991.0642 3005.4213 3068.7422 3112.2887 3126.2861 3136.2487 3171.9339 3582.3326 3589.7922 3603.4540
redmass: 5.1530 5.4041 6.1622 5.5225 5.9603 9.5068 7.7306 3.6005 4.7144 1.1222 9.2194 3.4664 2.9580 3.1343 4.3834 1.4273 2.1537 3.0569 9.8016 2.5920 6.4626 1.6586 4.8113 4.8110 5.0724 4.7557 1.4941 5.6408 1.5118 2.5775 1.8064 1.7938 3.2267 1.3471 2.8449 2.6301 2.5438 1.4349 1.3597 2.5072 1.1434 1.1948 1.9866 2.0691 2.9615 2.0989 1.6440 1.4133 1.3385 2.2636 1.7755 5.7322 2.8317 1.1066 2.7545 6.4191 6.4011 8.5221 9.5682 1.0824 1.0611 1.1035 1.0873 1.0903 1.0966 1.0952 1.0661 1.0802 1.0803
irintensity: 0.3509 0.8762 0.3729 0.6946 3.2186 3.1179 1.5906 4.4883 0.3794 144.0639 24.8602 7.8610 1.1433 6.3019 21.6818 81.3938 2.6981 48.3244 13.7968 87.5612 1.3954 81.1051 8.5757 22.8255 33.8629 17.4923 40.1093 2.8019 15.1689 24.7064 4.4183 6.1789 16.0094 0.8150 3.1035 2.5675 31.3991 45.6110 235.9287 67.8910 2.4650 23.1893 4.5302 70.5609 31.9239 129.2155 5.3745 6.7448 4.9420 130.1111 11.9178 12.8960 13.8849 12.0953 96.1379 8.3858 38.2061 563.8132 420.0648 9.7414 15.8935 10.9628 16.1317 16.2204 10.8808 4.0394 46.7746 76.0034 44.3559
temp: 298.150 k
press: 1.00000 atm
elementType: 8 8 8 7 7 6 6 6 6 6 6 6 6 6 6 1 1 1 1 1 1 1 1 1 1
symmnumber: 1
zpe: 497980.1 jmol-1
zpe.correction: 0.189671 hartree
zpe.thermalcorrener: 0.202692 hartree
zpe.thermalcorrenthalpy: 0.203636 hartree
zpe.thermalcorrgfe: 0.148531 hartree
zpe.sumelectzpe: -721.194481 hartree
zpe.sumelectthermal: -721.181460 hartree
zpe.sumelectthermalent: -721.180516 hartree
zpe.sumelectthermalfe: -721.235621 hartree
dipole: 3.5580 -1.7052 -1.1305
dipole: 4.1043
quadrupole: -86.5046 -101.9434 -83.9477
quadrupole: -4.4371 -8.6130 5.6099
quadrupole: 4.2940 -11.1448 6.8509 -4.4371 -8.6130 5.6099
hfenergy: -721.3841517 hartree
pointgroup: C01 [X(C10H10N2O3)]
dipole: -1.4161537 -0.6791777 0.3750004 debye
dipolederiv: -0.622086 0.2205443 0.0608467 0.2129412 -1.0903805 -0.1804749 0.0922223 -0.2130963 -0.3985069 -0.7574064 -0.2680321 -0.0232765 -0.5333962 -1.1679962 -0.1522266 -0.0472168 -0.1333594 -0.3897175 -1.4464461 0.2899484 0.2240483 0.3627586 -0.2171669 -0.2213139 0.2737606 -0.2162871 -0.4215646 -1.1683748 -0.2528282 -0.0198918 -0.3321616 -0.5269519 -0.0157186 -0.1003612 -0.0435367 -0.5005498 -0.6408578 -0.1652776 -0.0380355 0.0349507 -1.3999053 -0.2740695 0.0733473 -0.217281 -0.410383 -0.3890942 0.1713056 0.1177979 0.3953392 0.3834256 -0.0089103 0.2497104 -0.0115334 0.3053836 0.1543491 -0.0241724 -0.0237224 0.0167774 0.0566973 -0.0135771 -0.0114095 -0.0236037 0.1062663 0.1686833 -0.051568 -0.0234952 -0.0942084 -0.1546056 0.0317149 -0.0893946 0.0305946 -0.1438246 1.0642021 0.2155546 -0.0124829 -0.0908883 1.6266481 0.3171126 -0.2832837 0.311086 0.2769384 1.6931943 0.1644948 -0.1499286 0.4881384 1.868961 0.331362 -0.1363546 0.3326422 0.3857991 0.0206119 0.0578364 -0.1133562 -0.0545975 0.0710438 -0.0573197 -0.0570943 -0.1095813 -0.0585852 0.0339217 -0.1003184 -0.054774 -0.0238758 0.0730866 -0.1063205 -0.1042096 -0.0740095 -0.0671818 -0.2789679 0.0130951 0.0138219 0.3274152 -0.0920839 -0.1586431 -0.1073933 -0.0469095 -0.1271212 -0.327131 0.0804534 0.0099923 -0.1893855 0.0475402 -0.0245546 0.1593702 -0.1303622 -0.1500648 1.3340021 -0.314512 -0.3361154 -0.3641835 0.1340204 0.108818 -0.3727267 0.1096545 0.1703599 0.0835389 -0.0532641 0.0434811 -0.0694305 -0.0344304 0.0407389 0.0442377 0.045987 -0.0351843 0.0179007 -0.0075667 0.0069698 0.0088522 -0.0762339 -0.0483843 -0.012639 -0.0057046 0.0813373 -0.0042125 -0.003082 0.0427096 -0.0359296 0.0368326 0.1095636 0.0468891 0.0455799 -0.0459151 0.2622962 0.0234974 0.0324086 0.0088191 0.1419256 -0.0302392 0.1062391 0.009967 0.3418429 0.2420255 0.0100611 0.0237656 -0.0360877 0.1647912 -0.0457238 0.0360947 -0.0448155 0.3508255 0.0774129 0.0886314 0.0010674 0.0826782 -0.0506667 0.0570243 -0.0022108 0.0493186 0.1135964 0.0300904 -0.0637715 0.0911338 -0.0676251 0.0396901 0.0628678 0.0958727 0.0711498 0.0697671 -0.0337514 -0.0611075 0.1057778 -0.0501827 0.0429411 0.0771989 0.1142724 0.0814231 0.0918762 0.0753222 0.0604372 0.005898 0.0742229 -0.0101853 0.0581517 0.0117981 0.0569681 0.1391188 0.4107769 -0.0303592 0.0153597 -0.0709408 0.1330029 0.1429234 0.0204794 0.1257096 0.3154874 unknown
polarizability: 173.479032|-3.1632595|133.8533426|-17.6742027|-4.3418656|76.6952869 unknown
InChI: InChI=1S/C10H10N2O3/c13-7-3-1-6(2-4-7)5-8-9(14)12-10(15)11-8/h1-4,8,11-13H,5H2
charge 0 multiplicity 1
25 atoms
O  3.156157 -2.228384 -0.430796
O  3.37962 2.382113 0.570995
O  -4.936962 0.860393 0.54533
N  1.574204 0.822461 0.546964
N  3.614965 0.062236 0.017014
C  1.37207 -0.604407 0.25624
C  0.36669 -0.889924 -0.89925
C  -1.046276 -0.459187 -0.53889
C  2.806684 -1.071861 -0.096296
C  2.890615 1.240839 0.406857
C  -1.89485 -1.308397 0.21583
C  -1.539694 0.820159 -0.911196
C  -3.192589 -0.90099 0.592418
C  -2.832259 1.244691 -0.542837
C  -3.658882 0.38151 0.212557
H  1.037872 -1.152779 1.159379
H  0.418181 -1.975174 -1.104448
H  0.719465 -0.363388 -1.804947
H  0.8284 1.463702 0.81091
H  4.619352 0.08174 -0.160853
H  -1.544267 -2.307127 0.504231
H  -0.909829 1.48798 -1.511588
H  -3.836138 -1.577733 1.169624
H  -3.217876 2.226054 -0.834086
H  -5.445552 0.188172 1.06324
