program: Gaussian 09
title: 000233110
version: EM64L-G09RevD.01
frameworkgroup: C1[X(C10H9BrN2O2)]
method: RPBEPBE
basis: SDD
operation: Freq
keyword: #p
keyword: freq=noraman
keyword: PBEPBE/SDD
title: #p freq=noraman PBEPBE/SDD
converged: YES YES NO NO
title: Mulliken charges:
elementType: Br O O N N C C C C C C C C C C H H H H H H H H H
charge: 0.017353 -0.210094 -0.223340 -0.434512 -0.397045 0.037933 0.475456 0.182372 -0.689787 0.163979 -0.344443 -0.401339 -0.200596 -0.176969 -0.221300 0.330834 0.231241 0.237123 0.246951 0.353963 0.260189 0.256010 0.252628 0.253392
chargesum: 0.00000
title: Mulliken charges with hydrogens summed into heavy atoms:
elementType: Br O O N N C C C C C C C C C C
charge: 0.017353 -0.210094 -0.223340 -0.103678 -0.043082 0.037933 0.475456 0.182372 0.025529 0.163979 -0.084255 -0.145329 0.052032 0.076423 -0.221300
polarizability: 2.03484373e+02 -8.67727573e+00 1.32994429e+02 1.53707960e+00 -3.53711221e+00 8.33066892e+01
1716.lowfreq: -8.2741 -0.0007 -0.0006 -0.0003 4.0971 7.1161 35.7329 45.5964 63.8713
frequency: 35.6893 45.5578 63.8648 125.5674 158.7908 167.8615 202.2130 219.7253 236.2480 264.1155 316.5678 352.3235 377.7369 406.8267 411.0698 482.9773 499.8022 527.7551 599.4409 611.6407 623.5882 648.2230 665.6644 697.5821 718.9823 726.1349 743.7162 829.7743 835.7235 851.8991 945.4570 956.0744 972.0018 975.1157 994.3316 1057.5188 1072.8983 1092.3398 1112.1776 1150.6457 1192.2273 1208.6084 1233.7667 1295.1236 1307.7173 1316.5496 1359.5346 1364.1511 1387.4730 1393.0513 1462.9444 1470.9218 1473.9295 1578.3361 1594.5254 1683.3542 1724.9585 2996.2020 3097.3784 3111.2505 3149.9424 3153.8046 3171.2727 3175.8106 3586.3483 3601.0887
redmass: 4.4827 7.1419 10.2937 7.3873 7.4992 6.2800 3.9146 1.2010 5.5313 3.1748 6.8687 4.5541 6.7658 2.8851 6.4037 2.2426 1.4785 3.5017 6.1321 5.6734 6.7229 1.5052 2.9276 7.0649 4.4167 5.6739 4.4991 1.4990 1.4019 2.4809 2.0868 1.3791 1.3899 2.7075 4.6942 3.4814 2.1169 2.5324 1.6567 2.6323 1.1192 3.6788 3.9796 1.2542 2.5646 3.0652 1.7116 5.1236 2.7430 1.3560 1.2381 1.0548 1.7445 7.5280 6.1721 8.5589 9.4606 1.0351 1.1017 1.0999 1.0880 1.0885 1.0961 1.0972 1.0802 1.0800
irintensity: 0.2272 0.1864 0.7550 0.1391 3.9284 0.1957 1.5376 0.9890 1.3863 1.7605 8.6109 1.1037 11.5419 0.8670 6.3828 60.7139 86.9158 16.2403 10.1377 7.2876 3.7472 142.0406 15.2270 0.4047 16.0027 72.2473 13.2990 21.1718 19.0391 22.3457 6.8186 0.9034 1.9261 18.3495 68.2611 3.4750 41.6899 32.9596 1.8166 4.8419 2.6674 32.2351 100.0059 0.4602 161.6292 89.6842 10.7247 7.3183 6.8114 23.0591 16.8075 13.0937 73.3642 2.6140 15.9393 502.6352 442.3066 15.6013 22.6460 12.8810 1.9579 2.1283 6.9090 0.4462 80.5370 39.8897
temp: 298.150 k
press: 1.00000 atm
elementType: 35 8 8 7 7 6 6 6 6 6 6 6 6 6 6 1 1 1 1 1 1 1 1 1
symmnumber: 1
zpe: 459760.1 jmol-1
zpe.correction: 0.175113 hartree
zpe.thermalcorrener: 0.188630 hartree
zpe.thermalcorrenthalpy: 0.189574 hartree
zpe.thermalcorrgfe: 0.133167 hartree
zpe.sumelectzpe: -658.842474 hartree
zpe.sumelectthermal: -658.828958 hartree
zpe.sumelectthermalent: -658.828014 hartree
zpe.sumelectthermalfe: -658.884420 hartree
dipole: 0.1759 0.5930 2.4924
dipole: 2.5680
quadrupole: -108.9897 -101.2430 -93.0782
quadrupole: 7.2395 4.0940 1.2640
quadrupole: -7.8861 -0.1394 8.0255 7.2395 4.0940 1.2640
hfenergy: -659.0175875 hartree
pointgroup: C01 [X(C10H9Br1N2O2)]
dipole: 0.0249375 -1.0037573 0.1122573 debye
dipolederiv: -0.7670344 -0.1548244 0.0019102 -0.1692083 -0.07297 -0.0064434 -0.0057301 -0.0085868 -0.060365 -0.5186653 0.0530329 0.0396045 0.1373025 -0.4066228 0.1297102 0.0406227 0.0785646 -1.0762709 -0.9034149 0.2509663 0.3799322 0.3049498 -0.5108407 -0.1373208 0.5748059 -0.1873871 -0.9261462 -1.1098266 0.2625406 0.096384 0.3093425 -0.7224034 -0.0972042 0.0416518 -0.1135295 -0.3932437 -0.6982545 0.0870042 0.4261001 0.2718718 -0.4349266 -0.1176395 0.313633 0.0591392 -1.2379239 0.2908509 0.1606159 -0.2034593 0.1984089 0.1287028 0.1536551 -0.5043895 0.2640827 0.228595 0.2773048 0.0213389 0.0668849 0.0725212 -0.1159408 0.0101429 -0.0073291 -0.0247833 -0.1071766 0.8688388 -0.3558508 -0.4271251 -0.6954425 0.5016738 0.10561 -0.1272706 -0.0807916 1.3828067 -0.0774123 -0.0224737 0.0182601 0.0004166 0.0197841 -0.0817054 0.0824314 -0.0255436 -0.020691 1.386931 -0.6350281 -0.4522655 -0.8007012 0.8635806 -0.0582173 -0.6593602 -0.0315049 1.6579199 -0.0361168 0.0508232 0.0716896 -0.0149936 -0.1002926 0.0125152 -0.0268816 0.0334453 0.027049 -0.0782336 0.0050156 -0.0722804 0.0438319 -0.1083225 0.045248 0.0834345 0.060696 0.0027065 -0.3959589 -0.0853308 -0.1216821 -0.0912824 -0.1067711 -0.0068731 -0.0662177 0.0121989 0.0309538 -0.4045795 -0.0429977 0.1034191 -0.0642766 -0.0801785 0.0583688 0.0444565 0.038127 0.0235703 1.3237632 0.3187289 -0.0091669 0.3385538 -0.0414646 0.0402321 0.0140993 0.0348403 0.0234051 0.302513 0.0896118 0.009621 0.1404097 0.2486101 0.0080557 0.0489094 0.0109525 0.1766497 0.0633113 0.0797964 -0.0701168 0.0675771 -0.0165756 0.0472068 -0.0627988 0.079742 0.0136052 -0.152516 -0.0809362 -0.0058298 -0.0696903 0.0537797 -0.0084885 -0.0020844 -0.0023869 0.1011471 0.0980336 0.0226126 0.0770191 0.0402241 0.0709806 0.0174879 0.0881996 -0.0390034 -0.0486861 0.298212 0.0704658 0.0322168 0.0632478 0.3014774 0.0215735 0.0863427 0.0058455 0.1677163 0.0676184 -0.045617 -0.068942 -0.0368729 0.1158207 -0.0340994 -0.0619459 -0.0531798 0.0266919 0.0696058 -0.0093332 0.0885158 0.0059807 0.127465 -0.0250626 0.0878027 -0.0315444 -0.0012809 0.0401192 -0.0039442 0.0703739 -0.0119291 0.1508331 -0.0207384 0.0743068 -0.0235625 0.0055057 0.0549107 -0.0362168 -0.0510635 -0.0402416 0.1346011 -0.0560136 -0.0566883 -0.0558302 0.0034622 unknown
polarizability: 201.7213796|9.3713297|87.4166702|-13.2997645|11.8826806|130.6474412 unknown
InChI: InChI=1S/C10H9BrN2O2/c1-10(8(14)12-9(15)13-10)6-2-4-7(11)5-3-6/h2-5,12-13H,1H3
charge 0 multiplicity 1
24 atoms
Br 5.117598 0.79068 0.118308
O  -1.645259 0.445593 -2.072963
O  -3.46814 0.836158 2.258449
N  -1.705794 -0.500305 1.37056
N  -2.727136 0.933106 -0.016745
C  -1.029364 -0.719927 0.077564
C  0.465013 -0.338162 0.102549
C  -1.811923 0.282639 -0.843133
C  -1.244576 -2.168259 -0.437634
C  -2.712517 0.456447 1.335474
C  1.241519 -0.461835 -1.078555
C  1.083232 0.15011 1.277898
C  2.612069 -0.126739 -1.081816
C  2.456822 0.484473 1.292069
C  3.207808 0.33585 0.110132
H  -1.555766 -1.07511 2.197753
H  -0.695211 -2.884818 0.198122
H  -2.318183 -2.424345 -0.425559
H  -0.877007 -2.266192 -1.471891
H  -3.378728 1.654426 -0.327213
H  0.774238 -0.790112 -2.012123
H  0.494828 0.288302 2.190213
H  3.20098 -0.21912 -1.998647
H  2.925597 0.857639 2.206991
