program: Gaussian 09
title: 000233106
version: EM64L-G09RevD.01
frameworkgroup: C1[X(C9H13NO2S)]
method: RPBEPBE
basis: SDD
operation: Freq
keyword: #p
keyword: freq=noraman
keyword: PBEPBE/SDD
title: #p freq=noraman PBEPBE/SDD
converged: YES YES NO NO
title: Mulliken charges:
elementType: S O O N C C C C C C C C C H H H H H H H H H H H H H
charge: 0.923746 -0.536454 -0.539603 -0.487417 -0.207347 0.475492 -0.455019 0.468802 -0.388143 -0.351852 -0.809170 -0.801945 -0.602061 0.305934 0.240451 0.236227 0.216063 0.271626 0.276283 0.317294 0.234599 0.231427 0.236862 0.239948 0.253391 0.250864
chargesum: 0.00000
title: Mulliken charges with hydrogens summed into heavy atoms:
elementType: S O O N C C C C C C C C C
charge: 0.923746 -0.536454 -0.539603 -0.170123 -0.207347 0.475492 -0.149085 0.468802 -0.147692 -0.115625 -0.045198 -0.099056 0.142142
polarizability: 1.69393989e+02 6.50107795e+00 1.41544892e+02 -1.95383434e+00 2.56137496e+00 9.76804539e+01
1716.lowfreq: -35.3167 -9.9165 -4.7956 -0.0005 0.0017 0.0022 4.8065 42.9717 56.3800
frequency: -35.2489 42.9510 56.3633 114.1368 122.2301 140.2368 154.3142 157.5493 172.7223 223.9760 240.9163 256.3489 292.6012 306.6095 312.9953 385.1647 400.8419 439.5769 452.5246 457.9673 483.4818 559.5628 663.4064 709.7026 732.5489 797.1662 818.2143 833.2851 849.7122 917.9078 925.8773 972.8948 976.8191 1000.2488 1013.1973 1020.1970 1049.5046 1057.1575 1092.1549 1106.9551 1153.9753 1213.2614 1224.4853 1276.2624 1325.7828 1351.4765 1399.1675 1400.0874 1404.6865 1415.1615 1448.6486 1457.6001 1467.9409 1471.4965 1482.6290 1486.9602 1491.8126 1560.2886 1622.0645 2971.5075 2981.5676 2988.3980 3060.0149 3066.0355 3072.9170 3093.0356 3095.5218 3099.6858 3122.9899 3141.2634 3147.3426 3350.9605
redmass: 1.0306 3.6571 3.6091 2.6710 1.6530 1.9086 1.9134 1.5558 5.3380 4.9405 4.0668 5.0349 7.5410 3.1973 3.4393 5.0058 5.4495 4.0545 3.8935 4.2739 4.3797 3.9168 7.0399 3.2353 4.3659 13.6151 1.3761 1.2694 4.8577 1.3288 8.6351 1.3466 1.5676 3.2878 1.6800 2.0195 1.5531 1.5256 1.3785 1.4791 1.3095 1.6197 7.0262 1.4226 1.2022 3.5428 1.6537 2.1714 1.2100 1.1310 1.0388 1.0457 1.1250 1.0466 1.1073 1.0634 2.8887 4.7994 7.1815 1.0350 1.0376 1.0366 1.0977 1.0992 1.0969 1.0988 1.1007 1.1006 1.0877 1.0918 1.0966 1.0747
irintensity: 0.3529 2.6967 1.2852 1.7311 2.6618 0.3806 0.4029 1.9623 2.3403 10.2364 2.2007 2.7987 4.3989 3.1705 0.3571 6.7727 29.9733 38.7167 9.8978 11.5077 116.5300 2.9333 2.3533 3.9103 4.0392 72.9058 80.0893 25.3841 20.5576 9.7241 74.2663 0.2984 3.1015 2.4978 0.4198 2.9979 6.1017 20.4967 6.0487 14.2634 12.7039 7.0564 1.9750 4.7757 4.8456 10.0440 9.4842 0.8331 21.7384 7.9253 10.7638 16.5419 1.4558 14.3733 41.6582 10.6245 49.9964 1.7351 3.3167 36.8378 29.6262 15.9631 17.6399 12.8126 3.0957 14.8874 14.9145 16.2869 9.5482 2.7444 28.6924 11.7580
temp: 298.150 k
press: 1.00000 atm
elementType: 16 8 8 7 6 6 6 6 6 6 6 6 6 1 1 1 1 1 1 1 1 1 1 1 1 1
symmnumber: 1
zpe: 533265.6 jmol-1
zpe.correction: 0.203110 hartree
zpe.thermalcorrener: 0.217315 hartree
zpe.thermalcorrenthalpy: 0.218260 hartree
zpe.thermalcorrgfe: 0.162167 hartree
zpe.sumelectzpe: -952.854092 hartree
zpe.sumelectthermal: -952.839887 hartree
zpe.sumelectthermalent: -952.838942 hartree
zpe.sumelectthermalfe: -952.895035 hartree
dipole: -2.9126 0.7028 4.2409
dipole: 5.1925
quadrupole: -73.7145 -84.4489 -91.1891
quadrupole: 0.7585 10.0053 -2.0379
quadrupole: 9.4030 -1.3314 -8.0716 0.7585 10.0053 -2.0379
hfenergy: -953.057202 hartree
pointgroup: C01 [X(C9H13N1O2S1)]
dipole: -1.2033666 0.3419529 1.61504 debye
dipolederiv: 1.7649186 -0.1989742 0.1764958 -0.2101465 1.2099291 -0.0275245 0.0711566 -0.0393284 1.3889105 -0.6875416 0.0730497 -0.058691 0.0348002 -0.6964631 -0.1604756 -0.0185409 -0.0197246 -0.5569461 -0.7212886 0.0047946 0.0799462 0.0388859 -0.560397 0.1548575 0.0110838 0.0713781 -0.6365128 -0.4607727 0.016857 -0.1116894 0.0039341 -0.5507001 0.0050459 -0.0572364 -0.0176885 -0.4563692 0.0476853 -0.0467369 0.0054528 -0.1165783 -0.0978306 0.0204117 0.0015416 0.0350378 -0.2081432 -0.0372515 0.3796593 0.0340679 0.0024707 0.1233415 0.0015975 0.008098 -0.0338718 0.0152833 -0.244671 -0.2169452 -0.0368939 0.2446293 -0.1738425 -0.0024262 0.0504997 0.0210281 -0.1091447 0.2205772 0.3444174 0.0341297 0.1870529 0.1138036 0.0076741 0.0032877 -0.0034865 -0.0241224 -0.1118146 -0.2406639 -0.0381371 0.0327846 0.0157033 0.032907 -0.0111181 0.0536849 -0.1344219 0.0898053 -0.0471876 -0.0399562 -0.1418934 -0.0199539 0.0286757 -0.0439692 0.0192683 -0.1357121 -0.1491338 -0.1785946 -0.0248492 -0.1029182 -0.0207187 0.0297141 0.0125819 0.0347504 -0.0149454 -0.1207348 -0.1375449 -0.0120607 -0.0471349 0.0021321 -0.0039128 -0.0061822 -0.008608 0.0660844 0.0189224 0.0527133 -0.1993398 -0.1173011 0.2503074 -0.1607924 -0.0337284 -0.0137311 0.1034819 0.1799407 0.024278 0.0187899 -0.010651 0.0412912 -0.0159879 0.0058535 -0.0165957 0.1414524 0.0392554 0.032327 0.01144 0.0544987 -0.0941869 -0.040851 0.0224069 -0.0424193 0.1427814 -0.1168852 0.0387953 0.030434 0.0322973 0.091776 -0.0106129 0.0372911 -0.012273 0.1382194 0.0263626 0.1632991 0.0298967 0.0469045 -0.1015044 -0.0376896 0.0143575 -0.0614409 0.1082212 0.0329907 -0.0341554 -0.0733058 -0.0187576 0.0930307 0.040777 -0.0869247 0.0066505 0.0242072 0.0865484 -0.058024 0.0635255 -0.044583 0.1008963 -0.0380563 0.0584964 0.0234893 0.0009655 0.0588198 -0.0036885 0.0476065 0.0515782 0.2318721 0.0516884 -0.0182011 0.0796988 0.034403 0.0501661 0.1277041 0.0211922 0.0188286 -0.086045 -0.0239423 0.0097606 -0.031259 0.1047683 -0.0035357 -0.0503235 0.0916923 -0.0447933 0.0553126 -0.0290391 0.1317238 0.0302752 -0.0538463 -0.0332023 -0.0310057 -0.1069815 -0.0122585 0.0504291 0.0488478 -0.1356478 0.0003484 -0.0160812 0.0739136 -0.0262662 -0.0796222 -0.0109588 0.0717403 0.0267436 -0.1246203 -0.0019194 -0.0798271 0.0795398 0.0491458 0.0432647 0.1225921 -0.1096282 0.0678175 0.0502878 -0.066802 0.0596366 -0.0826143 -0.0369298 0.0935927 0.0067175 0.0597049 0.034553 0.0477422 -0.0064614 0.0976574 unknown
polarizability: 169.7478453|5.6853983|141.3321092|0.8346156|1.8665238|97.5393804 unknown
InChI: InChI=1S/C9H13NO2S/c1-7-4-5-8(2)9(6-7)13(11,12)10-3/h4-6,10H,1-3H3
charge 0 multiplicity 1
26 atoms
S  1.684789 -0.398869 -0.502034
O  1.660561 -2.010955 -0.775018
O  2.440781 0.59759 -1.546347
N  2.496194 -0.019291 1.158615
C  -0.107522 0.132647 -0.180855
C  -0.420125 1.490279 0.057442
C  -1.045577 -0.911475 -0.246189
C  -2.417991 -0.621297 -0.053017
C  -1.803773 1.751947 0.250731
C  -2.774243 0.729187 0.198459
C  0.607235 2.601548 0.114427
C  -3.469117 -1.714172 -0.122459
C  2.394748 -1.156784 2.111847
H  -0.699307 -1.930148 -0.454097
H  -2.114226 2.785057 0.44459
H  -3.829947 0.98424 0.352186
H  0.124362 3.564506 0.348187
H  1.3690 2.385123 0.885423
H  1.146268 2.692673 -0.845039
H  3.477407 0.193082 0.886901
H  -3.01223 -2.706316 -0.273656
H  -4.069087 -1.754476 0.805613
H  -4.172499 -1.537501 -0.957679
H  2.961459 -0.870515 3.016285
H  2.788014 -2.11603 1.722174
H  1.340227 -1.294849 2.403116
