program: Gaussian 09
title: 000233131
version: EM64L-G09RevD.01
frameworkgroup: C1[X(C22H21NO3S)]
method: RPBEPBE
basis: SDD
operation: Freq
keyword: #p
keyword: freq=noraman
keyword: PBEPBE/SDD
title: #p freq=noraman PBEPBE/SDD
converged: YES YES NO NO
title: Mulliken charges:
elementType: S O O O N C C C C C C C C C C C C C C C C C C C C C C H H H H H H H H H H H H H H H H H H H H H
charge: 0.918724 -0.270931 -0.526252 -0.514399 -0.284971 -0.374755 0.360270 0.350693 0.178128 0.148770 -0.022264 -0.630598 -0.376914 -0.367251 -0.362907 -0.375005 -0.446409 -0.225372 -0.271827 -0.261923 0.352478 -0.219410 -0.227984 0.333438 -0.418839 -0.806650 -0.805181 0.263487 0.260553 0.256996 0.223870 0.238203 0.249495 0.259418 0.261121 0.284516 0.298457 0.228850 0.225286 0.231821 0.232140 0.243506 0.238236 0.227278 0.231017 0.228801 0.232957 0.231330
chargesum: 0.00000
title: Mulliken charges with hydrogens summed into heavy atoms:
elementType: S O O O N C C C C C C C C C C C C C C C C C C C C C C
charge: 0.918724 -0.270931 -0.526252 -0.514399 -0.284971 -0.111267 0.360270 0.350693 0.178128 0.148770 -0.022264 0.110819 -0.138711 -0.117756 -0.103489 -0.113883 -0.161893 0.073085 -0.042977 -0.036637 0.352478 0.012412 0.004157 0.333438 -0.175333 -0.110118 -0.112092
polarizability: 3.59988455e+02 -4.09751639e+01 2.82878379e+02 -3.06316398e+01 -2.44189101e+01 1.95874411e+02
1716.lowfreq: -12.6228 -5.9647 -0.0008 -0.0006 -0.0001 1.8808 6.6338 26.6128 38.0535
frequency: -9.3986 26.4987 38.0412 53.2766 66.1717 73.9561 103.1188 108.0759 121.6977 127.5016 147.4360 156.6644 164.0005 188.8214 198.9453 222.9415 229.4815 231.5516 253.2042 261.7185 279.2681 293.1379 303.7119 304.6238 329.3338 352.9337 372.1593 398.0234 404.8556 410.3769 443.4420 444.8043 464.1256 476.6848 509.7207 519.3401 525.4230 540.4400 560.5994 576.1359 613.6634 615.3573 621.7086 663.3744 700.6123 714.7138 722.5663 734.8488 751.5040 761.6422 763.9765 794.4304 822.9379 831.9260 835.1390 842.5939 863.1875 866.5874 874.7827 894.5160 902.0282 934.3169 944.3444 947.1659 968.2204 979.1716 979.9845 988.4711 993.3855 1029.6560 1031.5129 1033.5664 1035.7583 1054.1021 1077.0732 1091.3801 1096.5953 1113.7331 1131.5341 1134.1255 1166.5533 1167.6535 1175.0063 1183.9539 1195.6811 1207.9995 1215.2817 1236.3054 1242.4857 1272.3642 1275.0971 1284.1946 1313.9265 1374.6930 1390.4571 1392.0737 1394.1207 1394.5800 1404.9093 1414.3024 1440.6499 1442.5021 1448.2572 1460.4913 1467.6367 1471.6627 1472.7859 1475.0688 1480.3283 1481.4643 1484.1611 1579.4393 1579.8406 1600.7977 1608.4951 1610.7170 1631.5312 2944.8241 2967.7336 2972.4834 2974.2898 3044.4161 3048.7992 3055.8216 3089.0146 3091.6628 3101.6551 3130.4114 3132.4667 3136.8642 3140.2432 3143.9688 3147.1732 3159.7609 3160.8392 3167.8691 3173.0060 3174.8828
redmass: 5.0157 5.1925 3.8932 4.7446 5.1336 6.0340 3.8578 1.0596 6.9330 3.5005 4.3050 3.7675 1.1648 3.9165 2.7162 2.3191 2.2953 5.8903 5.2539 3.9921 6.0128 2.6552 5.8509 4.2680 4.6882 5.0792 5.2071 4.8374 5.3540 5.6074 3.4023 2.9456 3.5975 5.3434 4.3122 4.1162 4.7550 4.5232 3.8692 5.7305 6.3099 6.5766 6.0699 6.3186 3.8838 2.9990 3.9267 4.3172 5.1834 1.4178 1.2858 13.7503 3.2480 3.0603 1.3466 5.1631 1.5213 2.9101 2.3769 5.3724 1.3454 13.8825 1.3853 1.4063 1.3425 1.3083 1.3143 1.4250 1.6429 2.2885 1.4631 2.8581 2.1430 1.6656 2.0731 2.0630 1.6263 1.8869 1.7153 1.7969 1.0756 1.1889 2.2441 2.1340 1.3577 2.5466 1.8757 2.4982 3.5923 1.2892 1.2254 1.4007 1.8101 5.0278 7.7649 1.2344 3.9640 5.2513 1.3166 1.1250 1.8678 1.2346 2.5235 1.0471 1.2220 1.8426 2.4665 1.0509 1.4317 1.2743 1.6248 6.6080 6.5699 7.4778 6.7807 6.9223 7.3785 1.0819 1.0357 1.0375 1.0384 1.0968 1.0967 1.1001 1.0986 1.0978 1.0983 1.0858 1.0854 1.0893 1.0904 1.0900 1.0917 1.0951 1.0949 1.0961 1.0991 1.0996
irintensity: 1.0889 0.6561 0.9677 0.5638 0.1368 2.2330 0.5008 0.0084 1.9371 0.9986 0.4904 0.3216 1.8837 1.9031 1.4019 0.9644 0.6631 7.7792 7.6937 3.2252 0.2679 1.1683 0.1994 11.9335 0.7348 3.4411 1.4842 5.4561 12.1892 5.2684 7.6950 9.2045 18.2702 85.4332 2.2076 0.4127 20.0998 2.5300 23.5760 12.3507 5.9444 3.1754 34.0740 1.5773 18.6582 2.1148 1.2163 0.5231 5.1301 192.1377 24.9501 63.1712 1.2175 5.3159 20.2121 3.6271 2.6699 10.2213 30.5976 27.5672 7.6949 62.1643 1.0842 4.6493 1.1908 0.0690 0.1531 9.6568 1.4645 8.2611 14.8198 15.5612 9.0394 0.2822 28.5937 18.6436 14.0448 11.0233 8.8740 4.0058 2.4422 7.1979 3.9601 0.3643 32.1327 15.5463 52.0529 3.3906 236.3779 19.5302 13.0837 4.1840 4.9858 6.3663 9.6629 6.5074 1.7840 2.5113 19.1712 16.1427 78.5606 50.8981 15.8453 0.0447 29.7790 44.6401 100.6825 31.4564 10.5047 14.4254 11.1202 37.1955 1.6265 9.6082 5.2779 34.0582 2.8966 7.8614 42.9641 58.3205 8.3685 35.5764 0.2173 15.5155 29.7351 4.9357 14.7277 0.1260 0.4688 9.8245 11.9548 15.0133 3.0555 18.9055 20.0737 5.1685 14.6277 14.8975
temp: 298.150 k
press: 1.00000 atm
elementType: 16 8 8 8 7 6 6 6 6 6 6 6 6 6 6 6 6 6 6 6 6 6 6 6 6 6 6 1 1 1 1 1 1 1 1 1 1 1 1 1 1 1 1 1 1 1 1 1
symmnumber: 1
zpe: 977552.9 jmol-1
zpe.correction: 0.372330 hartree
zpe.thermalcorrener: 0.396515 hartree
zpe.thermalcorrenthalpy: 0.397459 hartree
zpe.thermalcorrgfe: 0.319604 hartree
zpe.sumelectzpe: -1527.330737 hartree
zpe.sumelectthermal: -1527.306552 hartree
zpe.sumelectthermalent: -1527.305608 hartree
zpe.sumelectthermalfe: -1527.383463 hartree
dipole: -3.4232 1.5629 4.0964
dipole: 5.5626
quadrupole: -133.6310 -161.2021 -166.0752
quadrupole: -7.7310 -0.5958 -11.9914
quadrupole: 20.0051 -7.5660 -12.4391 -7.7310 -0.5958 -11.9914
hfenergy: -1527.7030669 hartree
pointgroup: C01 [X(C22H21N1O3S1)]
dipole: -1.4078687 0.4634344 1.6101432 debye
polarizability: 368.7549292|-30.6131579|273.1845596|-27.492627|-28.9722857|196.8017572 unknown
InChI: InChI=1S/C22H21NO3S/c1-15-12-13-17(14-16(15)2)27(24,25)23(3)22-18-8-4-6-10-20(18)26-21-11-7-5-9-19(21)22/h4-14,22H,1-3H3
charge 0 multiplicity 1
48 atoms
S  -0.071317 -1.387537 -0.593853
O  2.402455 1.860843 -0.994684
O  -0.013377 -3.010112 -0.784864
O  0.623278 -0.389038 -1.677171
N  0.579502 -1.014103 1.202488
C  1.582581 0.132783 1.278821
C  2.905906 -0.026351 0.535413
C  0.89313 1.440341 0.921406
C  3.216614 0.787325 -0.583894
C  1.308147 2.214179 -0.189667
C  -1.891734 -0.917689 -0.458778
C  1.010217 -2.302748 1.811895
C  3.877999 -0.977271 0.939026
C  -0.195369 1.913479 1.692875
C  4.39989 0.609723 -1.329651
C  0.645011 3.41026 -0.545435
C  -2.799613 -1.926775 -0.105147
C  -2.270943 0.395881 -0.761186
C  5.073119 -1.163154 0.214711
C  -0.859647 3.112323 1.365316
C  -4.178913 -1.616104 -0.030276
C  5.323913 -0.377243 -0.936481
C  -0.438805 3.858106 0.234705
C  -4.608122 -0.282071 -0.320747
C  -3.649066 0.696194 -0.685755
C  -5.178041 -2.694623 0.344444
C  -6.078967 0.083689 -0.252562
H  1.788685 0.133968 2.371394
H  1.849163 -2.807916 1.296282
H  0.154858 -2.996284 1.827931
H  1.301697 -2.079569 2.855567
H  3.699059 -1.573483 1.840345
H  -0.532578 1.307464 2.54136
H  4.577141 1.254064 -2.195583
H  0.996992 3.966529 -1.419118
H  -2.439618 -2.945101 0.076673
H  -1.532031 1.146038 -1.058323
H  5.803381 -1.909374 0.543907
H  -1.699031 3.460961 1.975534
H  6.243772 -0.520283 -1.513345
H  -0.949489 4.789579 -0.033167
H  -3.983921 1.713442 -0.917688
H  -4.675462 -3.657518 0.533842
H  -5.746477 -2.422946 1.254635
H  -5.922403 -2.854677 -0.459114
H  -6.493398 -0.090134 0.758998
H  -6.241149 1.14422 -0.507461
H  -6.681537 -0.528484 -0.950719
