program: Gaussian 09
title: 000018581
version: EM64L-G09RevD.01
frameworkgroup: C1[X(C23H31NO)]
method: RPBEPBE
basis: SDD
operation: Freq
keyword: #p
keyword: freq=noraman
keyword: PBEPBE/SDD
title: #p freq=noraman PBEPBE/SDD
converged: YES YES NO NO
title: Mulliken charges:
elementType: O N C C C C C C C C C C C C C C C C C C C C C C C H H H H H H H H H H H H H H H H H H H H H H H H H H H H H H H
charge: -0.214769 -0.138903 0.351372 -0.207850 -0.480364 -0.804774 -0.799953 0.452634 -0.564910 -0.623929 -0.632901 -0.611085 -0.361367 0.102790 0.447053 -0.236635 -0.418554 0.302120 -0.818840 -0.532917 -0.370024 0.432142 -0.225102 -0.353721 -0.816084 0.182404 0.254458 0.226303 0.227476 0.209217 0.226487 0.242963 0.216471 0.234057 0.262223 0.247407 0.225921 0.190165 0.213180 0.213796 0.182988 0.261350 0.219248 0.267373 0.221966 0.229784 0.240081 0.222463 0.222322 0.248731 0.280072 0.230535 0.234415 0.224601 0.231793 0.234319
chargesum: 0.00000
title: Mulliken charges with hydrogens summed into heavy atoms:
elementType: O N C C C C C C C C C C C C C C C C C C C C C C C
charge: -0.214769 -0.138903 0.351372 -0.025446 0.000397 -0.141594 -0.106462 0.452634 -0.055280 0.005337 0.025233 -0.391837 -0.093993 0.102790 0.447053 -0.014669 -0.188769 0.302120 -0.133974 -0.284186 -0.089952 0.432142 0.005433 -0.119305 -0.125372
polarizability: 2.96468569e+02 -2.42140293e+01 2.38453176e+02 -2.45361437e+01 -1.43748535e+01 2.33948875e+02
1716.lowfreq: -18.7885 -12.4702 -7.8963 -2.7951 -0.0007 -0.0002 0.0002 4.4943 13.0897
frequency: -18.0825 3.9046 12.9832 21.5516 40.1728 45.0435 48.1367 69.1691 85.8294 95.0780 127.2976 144.7190 155.1305 169.9762 185.3629 198.9600 206.9178 208.7937 213.4015 222.7074 231.0099 268.5382 273.9855 285.9197 297.5967 314.0955 326.9141 339.5051 343.8169 371.8594 391.2381 411.5410 415.3582 445.2770 448.2744 461.0904 484.2370 494.5974 516.2008 523.8069 558.1191 580.8473 587.2054 643.8731 654.1664 700.1977 716.4515 734.4427 765.3371 768.1566 777.9057 803.7960 814.1553 838.8155 875.4239 885.1699 895.7742 903.6854 916.1789 925.5356 935.5716 940.7309 948.0766 983.3451 986.0674 989.3706 990.9306 995.3039 998.2243 1003.8157 1008.1243 1011.3797 1021.5876 1034.0463 1048.1978 1050.1027 1080.5022 1088.2361 1095.7570 1096.2898 1120.5661 1131.7203 1147.1403 1162.5044 1177.0973 1179.2351 1181.2566 1193.1111 1208.8276 1218.8455 1234.5927 1243.2111 1250.7166 1280.6377 1292.6101 1300.9954 1305.8107 1315.3809 1319.5670 1359.2353 1377.6419 1382.9996 1383.4573 1394.7406 1396.7583 1399.5379 1416.5211 1417.0511 1425.6621 1434.7708 1445.1161 1458.8523 1459.3533 1466.6884 1468.0114 1469.5257 1470.7071 1471.8494 1472.0937 1472.8485 1480.8539 1483.4923 1484.0797 1484.4778 1500.4488 1506.9015 1572.5182 1596.2624 1605.7598 1613.5250 1614.2201 2792.5404 2850.6020 2869.4612 2973.0932 2973.6564 2976.0800 2978.2075 2982.4645 2998.7472 3028.4849 3033.7084 3036.8420 3053.9455 3055.2769 3057.5646 3064.3778 3072.5015 3082.2339 3084.1367 3091.0573 3092.8477 3094.9448 3104.6821 3111.0358 3117.4605 3119.8766 3135.0627 3139.8437 3143.4346 3163.7388 3167.5106
redmass: 1.0501 4.2766 4.1718 3.6403 5.3339 1.1864 2.6102 3.1021 3.2929 3.3643 3.4386 3.4885 3.4434 2.8422 2.2521 1.4894 1.5281 1.3273 2.9660 1.8988 1.9171 2.1024 2.1762 2.0998 3.4606 2.4771 2.9819 2.4430 4.2247 2.5255 2.3467 3.0404 3.0408 3.2620 2.8346 2.9334 2.3474 3.6724 4.9651 4.7460 2.7121 3.4681 2.5707 5.8841 5.9830 2.0634 2.5227 3.9482 1.6372 3.7418 2.5043 1.9541 1.5362 3.0367 3.3365 2.4496 1.4775 1.3841 2.2894 1.5204 1.7755 1.4282 1.5840 1.9739 1.5078 4.5197 3.7008 1.7300 1.6075 1.4224 1.8426 1.7781 1.8163 1.7039 1.5633 1.5629 2.6875 1.2788 1.5429 1.5383 1.6718 1.4306 1.8763 1.6263 1.1470 1.1935 1.8316 2.1241 2.1748 1.8513 2.2759 2.6028 3.0457 1.8446 1.7847 1.2140 1.2947 1.4572 1.3295 1.5619 5.3668 1.4172 3.8890 1.1995 1.2265 1.3007 1.6179 1.4458 2.3096 1.1701 1.1811 1.0701 1.0511 1.0821 1.0719 1.1000 1.1001 1.6500 1.0545 1.3598 1.1420 1.3272 1.1346 1.3799 1.0555 1.0493 6.6962 5.8317 7.4181 5.9387 6.3151 1.0806 1.0576 1.0578 1.0426 1.0384 1.0567 1.0374 1.0369 1.0642 1.0920 1.0747 1.0745 1.0958 1.0990 1.0977 1.0994 1.0980 1.0993 1.0989 1.0993 1.0905 1.0975 1.0976 1.0941 1.0867 1.0878 1.0908 1.0940 1.0919 1.0976 1.0952
irintensity: 0.5689 0.8381 0.1074 0.0572 1.3748 0.2708 1.2097 1.4339 0.1226 0.5056 0.2360 0.3665 0.2673 1.8416 3.4328 0.5094 0.5067 1.2350 2.4475 4.1651 0.2921 0.9000 0.4835 0.2752 0.6273 2.0583 5.1569 2.0610 5.5245 1.3911 2.7012 0.9255 2.7091 1.4423 4.3603 3.0157 0.2746 3.9042 0.4039 0.2882 7.2381 0.8548 0.4290 1.8695 7.3763 18.6460 18.4466 4.3079 38.0771 1.0825 36.0742 22.8036 23.1952 16.3122 0.8566 1.7577 3.6296 8.8421 20.9893 4.5799 2.6833 1.6501 1.0620 19.8755 0.4995 0.4556 0.0058 15.3987 4.3184 2.1073 27.8001 5.0195 10.5248 25.0364 16.7661 10.6095 4.4593 5.7248 13.7718 7.3586 7.8420 11.3004 8.0899 1.5084 0.9865 3.0435 14.2957 83.2687 19.8861 3.0063 2.8422 15.3100 7.3851 24.6608 108.6648 14.3824 4.2334 43.3517 7.5018 31.0352 1.6706 14.8737 19.0197 16.0994 10.6473 10.9727 1.2020 2.0610 3.6392 18.7039 8.1499 3.4195 8.5997 9.8348 8.6568 12.5486 13.8394 20.9289 11.2003 12.9420 21.9457 14.4064 19.9902 0.9327 16.4377 13.4463 113.6818 5.2724 20.6791 5.6781 17.4633 80.1857 74.4206 166.0322 18.3194 27.5019 68.9918 26.9586 20.8575 15.7193 7.2902 12.7383 79.7786 20.5039 28.1981 18.3485 9.2674 58.7429 15.2461 17.8514 22.2268 30.6532 44.6440 40.6927 31.7468 9.2804 10.0734 16.7249 29.0372 13.0832 16.8811 10.1929
temp: 298.150 k
press: 1.00000 atm
elementType: 8 7 6 6 6 6 6 6 6 6 6 6 6 6 6 6 6 6 6 6 6 6 6 6 6 1 1 1 1 1 1 1 1 1 1 1 1 1 1 1 1 1 1 1 1 1 1 1 1 1 1 1 1 1 1 1
symmnumber: 1
zpe: 1257551.0 jmol-1
zpe.correction: 0.478976 hartree
zpe.thermalcorrener: 0.505133 hartree
zpe.thermalcorrenthalpy: 0.506077 hartree
zpe.thermalcorrgfe: 0.419227 hartree
zpe.sumelectzpe: -1023.122066 hartree
zpe.sumelectthermal: -1023.095909 hartree
zpe.sumelectthermalent: -1023.094965 hartree
zpe.sumelectthermalfe: -1023.181816 hartree
dipole: -1.4403 -0.5486 4.0758
dipole: 4.3575
quadrupole: -138.1119 -145.8318 -155.5730
quadrupole: -3.2137 -8.6017 -3.1324
quadrupole: 8.3936 0.6738 -9.0674 -3.2137 -8.6017 -3.1324
hfenergy: -1023.6010423 hartree
pointgroup: C01 [X(C23H31N1O1)]
dipole: -0.6392337 0.1874696 -1.5796473 debye
polarizability: 295.7569388|26.4783076|241.0586486|22.818229|-14.1605052|232.0550325 unknown
InChI: InChI=1S/C23H31NO/c1-17-9-7-11-19(15-17)21(25)13-14-23(3,4)22(24(5)6)20-12-8-10-18(2)16-20/h7-12,15-16,22H,13-14H2,1-6H3
charge 0 multiplicity 1
56 atoms
O  -1.674306 0.129316 2.68083
N  3.647276 1.328632 -1.16773
C  1.821116 1.788998 0.661994
C  2.320745 0.921848 -0.586937
C  0.633854 1.064668 1.389366
C  1.296407 3.19526 0.22445
C  2.942738 1.970298 1.722934
C  2.399394 -0.578376 -0.251367
C  -0.685751 0.948487 0.603831
C  3.814889 2.758064 -1.510123
C  3.989177 0.499762 -2.352792
C  1.442259 -1.4854 -0.765156
C  3.446191 -1.090454 0.559163
C  -1.833252 0.386317 1.450742
C  1.471063 -2.870434 -0.457842
C  3.497744 -2.465478 0.868987
C  2.512433 -3.351158 0.373642
C  -3.168919 0.14791 0.793446
C  0.401579 -3.806813 -0.995182
C  -3.414004 0.449365 -0.574046
C  -4.218107 -0.397649 1.579422
C  -4.678362 0.218706 -1.166485
C  -5.481063 -0.635252 1.002498
C  -5.709676 -0.3301 -0.358709
C  -4.93671 0.550176 -2.626604
H  1.522531 1.042855 -1.370689
H  0.947196 0.057521 1.715594
H  0.428764 1.629226 2.319683
H  2.099747 3.941573 0.130146
H  0.759486 3.159748 -0.742048
H  0.59343 3.579533 0.988337
H  3.114488 1.035419 2.284357
H  2.644408 2.745476 2.453623
H  3.900031 2.267413 1.262161
H  -1.00531 1.937279 0.216557
H  -0.56344 0.301198 -0.285374
H  3.840124 3.383624 -0.60624
H  3.020552 3.155109 -2.19078
H  4.78653 2.880148 -2.021608
H  4.9927 0.784564 -2.715516
H  3.264877 0.630764 -3.197322
H  4.010884 -0.567764 -2.086472
H  0.661197 -1.112373 -1.442504
H  4.234016 -0.412076 0.899174
H  4.312702 -2.852417 1.491842
H  2.559285 -4.418876 0.620827
H  -0.502095 -3.786038 -0.355265
H  0.08587 -3.520718 -2.014731
H  0.757427 -4.851464 -1.027979
H  -2.614121 0.872738 -1.191954
H  -4.013447 -0.623386 2.631102
H  -6.289406 -1.057926 1.60941
H  -6.696233 -0.517943 -0.800959
H  -4.024783 0.918656 -3.12696
H  -5.292269 -0.336594 -3.183694
H  -5.713952 1.330836 -2.729046
