program: Gaussian 09
title: 000233071
version: EM64L-G09RevD.01
frameworkgroup: C1[X(C10H7NO3S)]
method: RPBEPBE
basis: SDD
operation: Freq
keyword: #p
keyword: freq=noraman
keyword: PBEPBE/SDD
title: #p freq=noraman PBEPBE/SDD
converged: NO YES NO NO
title: Mulliken charges:
elementType: S O O O N C C C C C C C C C C H H H H H H H
charge: 0.146118 -0.437633 -0.215815 -0.143496 -0.373378 0.321924 -0.285936 -0.165839 0.164995 -0.319787 0.260858 -0.399565 -0.276134 -0.196692 -0.058721 0.304080 0.244176 0.365112 0.224772 0.236676 0.235549 0.368735
chargesum: 0.00000
title: Mulliken charges with hydrogens summed into heavy atoms:
elementType: S O O O N C C C C C C C C C C
charge: 0.146118 -0.068898 -0.215815 -0.143496 -0.008266 0.321924 -0.285936 0.138240 0.164995 -0.075611 0.260858 -0.174793 -0.039458 0.038856 -0.058721
polarizability: 2.85000626e+02 3.69717084e+00 1.58134224e+02 1.25225836e-01 -8.78639769e-02 5.34504882e+01
1716.lowfreq: -6.9426 -2.4993 0.0007 0.0017 0.0022 4.8516 24.7641 59.5969 93.6376
frequency: 24.7583 59.5960 93.6375 103.2389 174.0376 196.5225 202.1246 222.6671 289.2548 347.8931 368.9167 413.7921 432.1526 444.9951 496.4902 504.7463 534.5867 546.2229 572.3673 590.1950 598.5652 632.0002 674.4098 684.7182 731.0728 746.1390 757.0904 784.8341 845.1062 853.6933 932.5503 968.7236 977.7345 987.1173 1045.0058 1075.0459 1127.7087 1156.1929 1176.2685 1211.2244 1240.1051 1272.3977 1304.9524 1341.6351 1345.6709 1395.2115 1442.4647 1490.2978 1584.1469 1603.6574 1611.8583 1642.8165 1700.1855 3115.9636 3119.6770 3145.0249 3157.1014 3174.9614 3547.5892 3590.6692
redmass: 6.5430 8.7534 7.8085 6.5055 9.1079 5.3970 8.2082 9.0588 4.4503 15.6866 1.1170 4.0971 4.9939 16.9949 3.1517 8.7772 7.5874 3.1922 10.9855 4.0654 7.5665 5.9314 1.8897 6.8707 2.8157 3.1417 1.3976 5.8354 1.4951 5.1599 1.3841 1.4213 1.3396 4.9011 2.1615 2.3595 3.6428 1.4195 1.1210 2.3498 2.9027 3.5862 1.9196 1.3924 1.5309 5.8329 2.4842 2.4822 6.0998 7.1366 7.0793 7.8137 11.4864 1.0870 1.0889 1.0879 1.0929 1.1000 1.0783 1.0662
irintensity: 0.0127 1.1536 0.2068 0.4490 9.6085 0.0497 0.4573 1.9494 3.6772 5.4064 141.2314 0.8499 27.6973 25.0953 29.1172 17.4946 24.4962 0.7478 23.3832 5.1674 32.8046 13.4914 40.4453 1.9408 47.5067 14.5291 142.8613 16.8497 0.6668 3.6131 0.5144 14.2915 0.0153 23.6521 1.4060 96.2324 193.3072 21.1117 28.7998 128.4043 240.3944 155.8616 1.6646 34.4203 27.4362 56.9176 47.5671 16.8806 14.0824 314.5077 36.9488 185.9767 672.3707 14.5448 12.3663 2.9413 16.1603 16.0152 93.4633 53.7228
temp: 298.150 k
press: 1.00000 atm
elementType: 16 8 8 8 7 6 6 6 6 6 6 6 6 6 6 1 1 1 1 1 1 1
symmnumber: 1
zpe: 397218.7 jmol-1
zpe.correction: 0.151293 hartree
zpe.thermalcorrener: 0.164160 hartree
zpe.thermalcorrenthalpy: 0.165104 hartree
zpe.thermalcorrgfe: 0.110669 hartree
zpe.sumelectzpe: -1062.712990 hartree
zpe.sumelectthermal: -1062.700123 hartree
zpe.sumelectthermalent: -1062.699179 hartree
zpe.sumelectthermalfe: -1062.753614 hartree
dipole: -5.6206 0.3269 -0.0268
dipole: 5.6301
quadrupole: -75.7856 -96.9291 -96.8982
quadrupole: 2.6508 0.2416 -0.2927
quadrupole: 14.0854 -7.0582 -7.0272 2.6508 0.2416 -0.2927
hfenergy: -1062.864283 hartree
pointgroup: C01 [X(C10H7N1O3S1)]
dipole: 2.1526263 -0.2338 0.4669237 debye
dipolederiv: -0.889502 0.0390671 -0.149872 0.1350042 -0.0916673 0.125232 -0.2476869 0.1131951 -0.1177257 0.0136169 -0.1360264 0.169811 0.2307378 -0.9003165 0.4947104 -0.1751846 0.4542606 -0.8477936 -0.6459647 -0.1376756 0.0941534 -0.4801419 -0.744561 0.3431962 0.4216359 0.3830077 -0.6487342 -1.38182 0.2852971 -0.4092129 0.4898188 -0.5283603 0.2803293 -0.607866 0.2553854 -0.6223604 -0.8843828 0.2019524 -0.2648185 0.2439658 -0.7799265 0.4785998 -0.3058429 0.4735063 -0.8096456 -0.3895589 0.0150597 -0.0562026 -0.2786593 -0.1397588 0.0845131 0.221355 0.1175996 -0.0999556 -1.2853351 -0.3197897 0.17327 -0.6165103 0.1107857 -0.3470218 0.462663 -0.309663 0.1827452 0.9436394 0.1105961 0.0072356 0.2851444 -0.0664994 0.0899117 -0.1600284 0.0693427 -0.0939832 0.0431181 0.2184658 -0.2067846 -0.3180755 0.6865725 -0.6156613 0.3001054 -0.5536777 0.6220665 0.2678122 0.0086328 0.0332134 0.2368654 -0.0091151 -0.0676698 -0.1840005 -0.0943071 -0.0447639 1.9325083 -0.0571914 0.2592287 0.5298005 0.8089091 -0.462053 -0.2998912 -0.5323034 0.744832 0.1116398 -0.2715903 0.2886565 0.0247394 -0.252969 0.0585057 0.0091087 0.0259534 -0.2170587 -0.6141623 0.0403173 -0.0884054 0.1504708 -0.0482903 -0.1072691 -0.1887856 -0.1207697 -0.0928651 0.1333259 0.035613 -0.0061362 -0.2751451 0.043959 -0.182174 0.2842457 -0.1455479 0.0529243 2.2252265 -0.1205857 0.3655117 -0.3140441 0.8480737 -0.6414955 0.5541715 -0.6169466 0.8870937 0.0853017 -0.0031792 -0.0057337 -0.0451106 0.1093073 0.0397707 0.0310892 0.043936 0.1182588 0.0371083 0.0570183 -0.0649896 0.0677234 0.0946376 0.0599955 -0.0730278 0.0584987 0.0871955 0.27123 0.0145655 -0.0264542 0.0095064 0.2588836 0.1051332 -0.0214075 0.105842 0.2622944 -0.0140611 0.0482072 -0.0662899 0.0915804 0.0616849 0.1160986 -0.1062812 0.1110454 0.0595559 0.0571336 -0.0257759 0.011149 -0.0603859 0.0289074 0.1249304 0.0444252 0.1290345 0.0557876 -0.1001694 -0.0554778 0.0228526 -0.0564847 0.1104222 0.0378703 0.0243012 0.0379343 0.1252095 0.0832955 0.0524998 -0.0801824 -0.0507998 0.3993212 -0.0154523 0.0169019 -0.0053264 0.3969226 unknown
polarizability: 281.0414872|1.2511811|109.080631|26.0865569|-52.6054308|106.4632201 unknown
InChI: InChI=1S/C10H7NO3S/c12-7-4-2-1-3-6(7)5-8-9(13)11-10(14)15-8/h1-5,11-12H
charge 0 multiplicity 1
22 atoms
S  -1.540095 1.115799 -1.372561
O  2.105782 -1.728651 1.751874
O  -2.569691 -1.713252 1.221977
O  -4.256762 1.341653 -1.935305
N  -3.571825 -0.245361 -0.319251
C  1.369616 -0.089666 0.13729
C  -1.194358 -0.158816 -0.104061
C  0.015704 -0.548546 0.413496
C  2.449489 -0.718288 0.844904
C  1.713953 0.942992 -0.786114
C  -2.454821 -0.803924 0.360078
C  3.792128 -0.334078 0.635683
C  3.04988 1.330701 -0.999078
C  4.092509 0.690075 -0.286759
C  -3.385865 0.761773 -1.266248
H  -0.065778 -1.346886 1.1646
H  0.92414 1.453044 -1.345126
H  -4.515451 -0.583607 -0.113634
H  4.598578 -0.83167 1.189501
H  3.280587 2.126317 -1.714034
H  5.134368 0.986568 -0.447534
H  2.905812 -2.112178 2.188201
