program: Gaussian 09
title: 000233060
version: EM64L-G09RevD.01
frameworkgroup: C1[X(C10H11ClN4O)]
method: RPBEPBE
basis: SDD
operation: Freq
keyword: #p
keyword: freq=noraman
keyword: PBEPBE/SDD
title: #p freq=noraman PBEPBE/SDD
converged: YES YES NO NO
title: Mulliken charges:
elementType: Cl O N N N N C C C C C C C C C C H H H H H H H H H H H
charge: 0.025256 -0.443527 -0.192451 -0.032799 -0.020429 0.062110 -0.071674 -0.122675 -0.476115 -0.445890 -0.416096 0.125956 -0.210727 0.116108 -0.301521 -0.363747 0.225488 0.257126 0.256987 0.234858 0.247330 0.222768 0.224278 0.218232 0.277648 0.346733 0.256772
chargesum: 0.00000
title: Mulliken charges with hydrogens summed into heavy atoms:
elementType: Cl O N N N N C C C C C C C C C C
charge: 0.025256 -0.096794 -0.192451 -0.032799 -0.020429 0.062110 0.153814 0.134451 0.015730 0.024208 0.026414 0.125956 0.066920 0.116108 -0.301521 -0.106975
polarizability: 2.00168007e+02 8.61131609e-01 1.41887677e+02 -7.15873175e+00 7.88127878e+00 8.95994862e+01
1716.lowfreq: -9.8129 -4.0162 0.0009 0.0015 0.0022 9.1814 31.0827 34.4777 48.6470
frequency: 29.9334 34.4525 48.5743 78.4270 117.1246 156.4760 184.7944 209.1155 246.5226 277.0525 288.9065 347.8864 360.8386 384.5851 432.9512 505.0044 543.8339 549.2159 569.1108 604.5050 627.2114 647.3325 658.8579 751.3094 790.1474 793.5641 805.6437 844.0147 847.8907 895.8990 907.0631 914.3642 945.3516 953.4104 1003.6382 1042.1447 1069.0957 1095.3485 1100.6767 1126.1024 1154.6370 1163.2084 1190.3476 1194.5195 1219.0535 1240.9097 1258.7084 1265.3845 1286.5517 1287.0784 1295.2457 1303.0085 1303.8407 1325.6776 1363.5431 1379.7474 1387.1885 1401.7672 1446.8789 1471.7535 1477.4688 1492.0732 1500.8431 1561.6659 2992.8573 3010.9963 3016.7070 3023.4030 3029.1247 3066.2680 3085.8422 3098.3747 3184.7663 3230.7239 3568.1441
redmass: 2.1875 6.3875 4.0938 3.8822 8.1526 3.2180 9.2959 7.3492 4.9912 1.1060 5.8652 6.5616 3.4796 13.2118 3.8629 4.1720 4.9767 5.2221 7.3627 3.3033 6.6210 4.9798 8.1591 1.9201 6.9932 2.5244 2.9216 2.9038 1.6692 6.9568 2.7393 1.4342 1.6046 1.7386 3.1663 2.7764 2.4601 3.5752 4.8919 4.0116 2.2148 1.6594 1.9658 1.8146 1.2961 1.3957 1.2282 1.7746 1.5237 5.5379 1.3879 1.8502 1.8344 1.7107 5.2924 1.5255 1.3959 2.0319 4.0911 1.0763 1.0867 1.0973 7.6536 10.0443 1.0852 1.0603 1.0723 1.0744 1.0642 1.1021 1.1048 1.1041 1.0929 1.0987 1.0664
irintensity: 0.7533 0.1640 0.2546 1.1491 0.6602 1.0006 1.0801 1.7752 7.0594 142.3472 0.7501 6.0045 5.5013 5.2644 3.6465 12.3767 4.0162 8.1296 8.7060 1.0056 5.8948 14.9554 7.7132 5.5295 4.7695 43.5819 7.8021 9.2615 6.8093 83.0783 4.3992 12.4754 12.2782 1.3318 63.4378 33.1005 8.9983 4.7433 28.2663 8.5768 68.4769 20.0773 12.5983 58.7006 5.3177 21.6157 2.0655 8.2525 7.9840 54.9762 13.7524 42.4246 25.7362 13.8525 31.2984 2.6959 42.9328 37.8171 115.4782 1.8926 10.6801 12.9745 130.3621 76.6859 4.9307 22.0990 21.7661 33.9788 32.0923 8.8182 5.2846 47.4925 8.3408 0.2503 7.3386
temp: 298.150 k
press: 1.00000 atm
elementType: 17 8 7 7 7 7 6 6 6 6 6 6 6 6 6 6 1 1 1 1 1 1 1 1 1 1 1
symmnumber: 1
zpe: 538718.4 jmol-1
zpe.correction: 0.205187 hartree
zpe.thermalcorrener: 0.219029 hartree
zpe.thermalcorrenthalpy: 0.219973 hartree
zpe.thermalcorrgfe: 0.162437 hartree
zpe.sumelectzpe: -1140.771583 hartree
zpe.sumelectthermal: -1140.757741 hartree
zpe.sumelectthermalent: -1140.756797 hartree
zpe.sumelectthermalfe: -1140.814334 hartree
dipole: 4.8661 0.3461 -0.9492
dipole: 4.9699
quadrupole: -114.3761 -100.7978 -98.8290
quadrupole: 0.2788 -6.6132 1.5153
quadrupole: -9.7085 3.8698 5.8386 0.2788 -6.6132 1.5153
hfenergy: -1140.9767704 hartree
pointgroup: C01 [X(C10H11Cl1N4O1)]
dipole: -1.8835671 0.3047465 0.4271819 debye
polarizability: 199.0111663|-6.1658334|142.1072722|-11.1480629|-8.1915949|90.5367317 unknown
InChI: InChI=1S/C10H11ClN4O/c11-9-8-10(13-4-12-9)15(5-14-8)6-2-1-3-7(6)16/h4-7,16H,1-3H2
charge 0 multiplicity 1
27 atoms
Cl 4.676567 -0.856471 -0.19247
O  -2.652259 -1.001593 -1.843648
N  -0.350806 -0.788127 0.366031
N  1.585873 -2.046927 0.403231
N  0.631673 1.421119 -0.213738
N  3.061837 1.309168 -0.465958
C  -1.790289 -0.474358 0.466722
C  -2.414261 0.055463 -0.857896
C  -2.152997 0.618802 1.498738
C  -3.77023 0.641821 -0.404556
C  -3.618095 0.98882 1.116244
C  0.692301 0.090018 0.062751
C  0.249374 -2.044452 0.556338
C  1.890523 -0.713366 0.093128
C  3.079334 -0.004744 -0.190707
C  1.854072 1.965904 -0.468674
H  -2.301736 -1.424759 0.7141
H  -1.751466 0.84368 -1.268638
H  -1.481611 1.484718 1.361338
H  -2.05023 0.265914 2.538876
H  -4.543376 -0.129671 -0.567963
H  -4.047804 1.51775 -1.013355
H  -4.33477 0.401193 1.717442
H  -3.822005 2.053155 1.321605
H  -0.343835 -2.922436 0.806177
H  -1.813201 -1.204205 -2.328909
H  1.885315 3.033284 -0.699808
