program: Gaussian 09
title: 000233064
version: EM64L-G09RevD.01
frameworkgroup: C1[X(C11H13ClN4O5)]
method: RPBEPBE
basis: SDD
operation: Freq
keyword: #p
keyword: freq=noraman
keyword: PBEPBE/SDD
title: #p freq=noraman PBEPBE/SDD
converged: YES YES NO NO
title: Mulliken charges:
elementType: Cl O O O O O N N N N C C C C C C C C C C C H H H H H H H H H H H H H
charge: 0.030987 -0.250662 -0.457269 -0.437783 -0.450423 -0.212202 -0.171891 -0.026116 -0.113924 0.031688 -0.168301 -0.083709 -0.184543 -0.103571 -0.349499 0.253794 -0.203788 -0.097477 0.177033 -0.307335 -0.502468 0.275542 0.248777 0.263722 0.255532 0.219672 0.218202 0.360212 0.400395 0.279912 0.363733 0.248736 0.244114 0.248909
chargesum: 0.00000
title: Mulliken charges with hydrogens summed into heavy atoms:
elementType: Cl O O O O O N N N N C C C C C C C C C C C
charge: 0.030987 -0.250662 -0.097057 -0.037388 -0.086689 -0.212202 -0.171891 -0.026116 -0.113924 0.031688 0.107241 0.165067 0.079179 0.151961 0.088375 0.253794 0.076124 -0.097477 0.177033 -0.307335 0.239290
polarizability: 2.33078815e+02 -2.48973694e+00 1.91054511e+02 4.53177842e+00 -7.48679003e-01 1.01375471e+02
1716.lowfreq: -60.3841 -6.7160 0.0013 0.0014 0.0020 4.3277 6.9239 27.7631 37.0521
frequency: -60.2090 27.5775 36.9334 64.1294 99.7731 104.9591 114.5238 119.5253 130.6413 158.5437 181.8267 189.4100 205.5862 229.8592 233.6309 270.5635 278.7787 302.2357 328.3256 349.4522 371.1643 377.5078 388.0339 439.2749 465.0149 502.2917 515.1617 558.4593 613.3371 629.0467 658.3575 663.0771 677.3898 693.7714 750.2113 760.4253 782.9293 794.2553 806.3077 833.4494 844.1144 872.7397 881.5971 895.1893 934.0698 937.8668 980.1953 991.1838 1008.8391 1033.7685 1052.7940 1055.6314 1085.6965 1112.9074 1128.1509 1152.5619 1155.0762 1160.7396 1181.0869 1197.2916 1220.6682 1239.5563 1250.1179 1265.8311 1280.1150 1298.9361 1302.4559 1312.8800 1334.6192 1337.0567 1357.7997 1362.1853 1380.0113 1387.8377 1409.9283 1441.4498 1451.3303 1453.4489 1456.9038 1459.9065 1485.5317 1534.8430 1569.7706 2974.9206 2984.9828 3013.8287 3031.8152 3036.0384 3049.7072 3055.4727 3077.8218 3121.4014 3160.2084 3231.8401 3518.9997 3573.8593
redmass: 1.4163 8.0699 5.3237 6.1185 6.1407 7.9186 3.8501 4.5636 1.2005 4.3960 6.0590 4.8013 4.2244 4.7206 8.0593 7.4872 4.4372 3.7040 5.7956 5.0243 13.3801 5.4345 5.4737 5.6810 3.0015 1.4631 9.0402 7.0505 4.3369 6.1597 6.0258 11.8032 6.8025 7.7980 7.0404 7.8087 6.5812 4.5026 4.6242 1.5307 1.2340 3.2144 8.2951 8.6876 4.1053 3.3725 2.7419 3.5985 4.9424 3.7235 4.3086 5.2205 1.8351 1.2516 3.7065 1.9244 1.2906 3.2977 1.1656 2.2223 1.3710 1.4708 1.4260 1.8913 1.3255 2.6343 1.6833 1.3897 2.5607 6.4878 1.8519 1.4160 1.3429 2.0325 2.7445 1.4671 3.4781 1.0508 1.0800 1.0786 1.1637 6.8617 9.6472 1.0727 1.0657 1.0289 1.0863 1.0881 1.0850 1.0872 1.0981 1.1052 1.1057 1.0990 1.0657 1.0663
irintensity: 163.6899 0.6709 1.5067 1.6915 22.4576 3.9581 4.3138 6.7494 0.6124 6.2874 55.3678 7.1331 42.1852 55.4750 1.3475 9.7965 5.0747 10.7849 3.8087 5.9673 4.7518 4.1910 9.7288 1.5729 55.7948 94.4052 5.5935 4.2700 13.4115 14.6792 1.0216 1.2372 16.4245 12.8916 37.6616 59.4939 2.2380 24.6676 87.6546 31.8757 78.5455 17.9703 56.7187 0.7646 29.0214 46.1911 47.3175 97.8265 9.5986 160.6789 45.6642 27.7049 2.6719 0.0448 55.2638 34.6708 33.0237 60.6840 47.5738 162.0770 26.5851 9.9025 56.8837 84.0341 16.0970 76.3634 67.8380 18.2461 59.7637 215.1637 15.9519 11.1726 48.3322 33.7938 21.5544 14.1292 62.2233 16.1942 8.0772 28.7895 35.3080 230.8315 352.2171 1091.3615 93.3428 28.8504 26.0517 25.6645 12.5844 16.4208 19.8837 19.3298 14.7786 0.6293 14.8092 18.5407
temp: 298.150 k
press: 1.00000 atm
elementType: 17 8 8 8 8 8 7 7 7 7 6 6 6 6 6 6 6 6 6 6 6 1 1 1 1 1 1 1 1 1 1 1 1 1
symmnumber: 1
zpe: 650716.6 jmol-1
zpe.correction: 0.247845 hartree
zpe.thermalcorrener: 0.266550 hartree
zpe.thermalcorrenthalpy: 0.267494 hartree
zpe.thermalcorrgfe: 0.200207 hartree
zpe.sumelectzpe: -1480.541587 hartree
zpe.sumelectthermal: -1480.522882 hartree
zpe.sumelectthermalent: -1480.521938 hartree
zpe.sumelectthermalfe: -1480.589224 hartree
dipole: -1.9190 -1.2696 0.0098
dipole: 2.3010
quadrupole: -121.4653 -140.0699 -127.2242
quadrupole: -5.5604 2.8736 -4.8252
quadrupole: 8.1212 -10.4835 2.3622 -5.5604 2.8736 -4.8252
hfenergy: -1480.7894315 hartree
pointgroup: C01 [X(C11H13Cl1N4O5)]
dipole: -0.8146239 0.3924696 0.0431989 debye
polarizability: 231.6790873|8.4016208|191.4932978|-3.4783679|9.3846263|102.3364112 unknown
InChI: InChI=1S/C11H13ClN4O5/c1-20-9-5-8(14-11(12)15-9)16(3-13-5)10-7(19)6(18)4(2-17)21-10/h3-4,6-7,10,17-19H,2H2,1H3
charge 0 multiplicity 1
34 atoms
Cl -1.520152 -3.598972 -0.527396
O  2.080723 0.615739 1.239735
O  3.407657 1.549096 -1.373822
O  1.82003 -1.826947 -1.178987
O  5.055011 0.279323 0.707069
O  -4.501768 0.397104 0.263105
N  0.070163 1.291904 0.047158
N  -2.024848 2.218116 0.340466
N  -0.608106 -1.089491 -0.245276
N  -3.012618 -1.399791 -0.096016
C  2.258832 0.650053 -1.15748
C  1.553167 1.290264 0.061716
C  2.690541 -0.782366 -0.695585
C  2.755466 -0.679089 0.858799
C  4.175021 -0.6364 1.437984
C  -0.841048 0.240173 -0.035307
C  -0.706877 2.448495 0.284297
C  -2.132774 0.831255 0.144679
C  -3.234527 -0.068145 0.103476
C  -1.743688 -1.824945 -0.257842
C  -5.608817 -0.594578 0.211789
H  1.6285 0.593066 -2.063773
H  1.843977 2.353499 0.121025
H  3.688201 -1.016358 -1.106529
H  2.177706 -1.502251 1.318392
H  4.64269 -1.631549 1.343531
H  4.120214 -0.364749 2.511698
H  4.133386 1.052852 -1.830039
H  0.879699 -1.676225 -0.81015
H  -0.24164 3.424908 0.406128
H  4.599857 1.159353 0.629343
H  -5.62087 -1.100078 -0.767331
H  -6.512172 0.011172 0.363936
H  -5.485036 -1.343838 1.010306
