program: Gaussian 09
title: 000233082
version: EM64L-G09RevD.01
frameworkgroup: C1[X(C20H15Cl2NO3S)]
method: RPBEPBE
basis: SDD
operation: Freq
keyword: #p
keyword: freq=noraman
keyword: PBEPBE/SDD
title: #p freq=noraman PBEPBE/SDD
converged: YES YES NO NO
title: Mulliken charges:
elementType: Cl Cl S O O O N C C C C C C C C C C C C C C C C C C C C H H H H H H H H H H H H H H H
charge: 0.005176 0.010571 0.921334 -0.269712 -0.523152 -0.510368 -0.285297 -0.365766 0.358013 0.358109 0.180004 0.131592 -0.639637 -0.380790 -0.373782 0.012991 -0.362037 -0.376773 -0.271126 -0.259177 -0.217422 -0.217129 -0.229824 -0.223898 -0.049953 -0.173907 -0.105550 0.270070 0.257304 0.280969 0.230906 0.243455 0.246803 0.261052 0.263682 0.231711 0.234284 0.234621 0.233991 0.296349 0.303537 0.268779
chargesum: 0.00000
title: Mulliken charges with hydrogens summed into heavy atoms:
elementType: Cl Cl S O O O N C C C C C C C C C C C C C C C C C C C C
charge: 0.005176 0.010571 0.921334 -0.269712 -0.523152 -0.510368 -0.285297 -0.095696 0.358013 0.358109 0.180004 0.131592 0.129541 -0.137335 -0.126980 0.012991 -0.100985 -0.113092 -0.039415 -0.024893 0.017198 0.016862 0.066525 0.079639 -0.049953 0.094872 -0.105550
polarizability: 3.77356997e+02 -3.92243568e+01 2.55394495e+02 -3.55884995e+01 -3.63194853e+01 1.88963876e+02
1716.lowfreq: -12.5508 -6.0574 -0.0010 0.0007 0.0014 4.0917 11.7627 21.8588 33.7817
frequency: 9.3325 20.5640 33.7553 49.3985 66.4693 76.9559 96.4718 105.0124 117.4360 142.9972 147.6098 162.8057 181.5187 188.0802 212.0975 217.1754 228.5419 250.1715 262.2677 268.8723 289.0339 302.5780 326.4208 350.9307 364.1447 376.2753 396.7091 398.5947 417.9203 431.6830 434.8926 462.0221 471.3797 510.7345 519.3256 528.0758 538.1827 555.0040 578.1817 614.0723 619.0414 650.7455 663.2644 690.2889 701.0174 724.2232 741.8921 751.6957 762.7509 766.4194 800.5895 820.4270 827.0913 833.3140 864.8827 865.6337 867.1671 875.8153 894.2623 932.2013 946.1783 953.4135 963.9624 982.0099 987.6103 992.1377 1029.0333 1033.0037 1036.6488 1062.5844 1091.3280 1095.3187 1113.0211 1115.4801 1130.2875 1131.5307 1167.6340 1168.2509 1174.3101 1192.8253 1207.0032 1213.2881 1238.7950 1242.1988 1270.6964 1283.0559 1313.9696 1362.1988 1374.4310 1390.2723 1393.6454 1407.7400 1431.5928 1442.0782 1445.3679 1448.4321 1470.3519 1479.9711 1490.7442 1563.2499 1578.9998 1584.1581 1599.8941 1610.0661 1630.4417 2945.7403 2966.9179 3054.9475 3107.6989 3129.7316 3130.3301 3140.3702 3143.5971 3160.1467 3161.3291 3163.8946 3172.9034 3173.8148 3175.8142 3179.8140
redmass: 9.2081 7.9295 10.7315 6.2849 5.2375 6.3242 10.2525 4.0358 7.1381 3.3768 4.2907 5.3608 23.1949 2.9024 13.7927 3.2143 2.7272 11.0070 4.1020 4.7314 7.1588 6.3821 4.7888 5.2719 5.9834 7.4131 5.1297 7.4963 4.8131 6.2817 3.1527 4.9406 4.8901 4.2406 4.1911 8.7155 4.5515 5.6360 5.8844 6.3544 5.9054 7.3792 6.3411 3.8016 3.9470 3.9507 9.0025 6.0008 1.3723 1.2851 15.2524 3.1299 1.3937 3.1960 2.1894 1.9165 1.4918 2.1336 5.3126 18.0856 1.3801 1.3919 1.3422 1.3152 1.3199 8.2548 2.2071 2.1275 3.2759 2.2800 2.1005 1.6676 2.0516 3.2816 1.5029 1.3129 1.1483 1.1051 2.2598 1.3582 2.5302 1.8940 1.2986 3.3739 1.2126 1.4145 1.8342 3.3239 10.7401 7.6588 9.7255 1.1263 2.3937 2.2794 1.1102 2.4913 2.5668 2.6101 1.0618 6.8859 6.5846 8.8199 7.4397 6.9321 7.3841 1.0825 1.0356 1.1006 1.0974 1.0868 1.0869 1.0898 1.0894 1.0945 1.0947 1.0888 1.0997 1.0929 1.0996 1.0975
irintensity: 0.0658 0.1913 0.4757 2.0942 0.5174 1.0473 3.0743 0.0973 1.9714 0.3930 0.7528 2.2128 0.4322 0.4571 3.4743 1.4091 0.5518 1.5722 0.6150 12.7853 8.5638 1.1679 3.2298 6.9662 4.1173 4.6392 8.2639 14.1728 4.1951 15.3374 12.4937 43.8534 35.8894 6.7243 1.2404 20.5643 0.3982 30.6074 14.4703 2.3269 14.7884 30.0708 1.0035 1.6801 17.2428 1.3488 28.3927 5.9427 175.7660 34.8718 79.2866 1.9860 22.9740 5.1013 15.8385 2.3866 8.1781 24.5991 30.9962 61.5898 1.8918 2.6363 0.6546 0.1312 0.3338 43.6717 5.3001 9.3154 15.6458 21.4802 20.8264 19.3917 14.1116 61.3635 5.2884 11.8683 4.6274 5.5557 4.3577 30.7757 15.6721 60.1004 0.9444 224.8974 33.4008 3.5854 4.5510 37.9098 1.1923 8.2121 0.9282 24.2748 78.2478 115.3515 27.9721 11.2824 114.9372 7.0439 16.7093 6.3784 35.5772 9.3173 8.2019 37.2688 4.2413 7.2730 40.6380 16.7625 3.4665 2.2680 0.7700 8.7157 11.9714 12.7452 18.9414 3.4190 11.3055 3.7718 14.0363 4.1717
temp: 298.150 k
press: 1.00000 atm
elementType: 17 17 16 8 8 8 7 6 6 6 6 6 6 6 6 6 6 6 6 6 6 6 6 6 6 6 6 1 1 1 1 1 1 1 1 1 1 1 1 1 1 1
symmnumber: 1
zpe: 783570.0 jmol-1
zpe.correction: 0.298446 hartree
zpe.thermalcorrener: 0.322786 hartree
zpe.thermalcorrenthalpy: 0.323730 hartree
zpe.thermalcorrgfe: 0.242590 hartree
zpe.sumelectzpe: -2367.643250 hartree
zpe.sumelectthermal: -2367.618910 hartree
zpe.sumelectthermalent: -2367.617966 hartree
zpe.sumelectthermalfe: -2367.699106 hartree
dipole: 1.3860 2.0838 3.4993
dipole: 4.3021
quadrupole: -171.5325 -174.4639 -178.0968
quadrupole: -9.8832 4.6508 -15.5762
quadrupole: 3.1653 0.2338 -3.3991 -9.8832 4.6508 -15.5762
hfenergy: -2367.9416957 hartree
pointgroup: C01 [X(C20H15Cl2N1O3S1)]
dipole: 0.5213616 -0.9971444 -1.2643878 debye
polarizability: 379.9917663|37.6946599|242.5426859|31.7971145|-43.7193821|199.1809164 unknown
InChI: InChI=1S/C20H15Cl2NO3S/c1-23(27(24,25)13-10-11-16(21)17(22)12-13)20-14-6-2-4-8-18(14)26-19-9-5-3-7-15(19)20/h2-12,20H,1H3
charge 0 multiplicity 1
42 atoms
Cl -5.211318 1.993983 -1.272568
Cl -6.019438 -0.635206 0.521208
S  -0.004004 1.72176 0.747017
O  2.011833 -1.766365 0.867935
O  -0.158725 3.337612 0.915609
O  0.778331 0.836992 1.871395
N  0.649568 1.480302 -1.062995
C  1.44211 0.192757 -1.284075
C  2.799207 0.073434 -0.596114
C  0.559333 -1.010107 -0.989651
C  2.993552 -0.834481 0.475726
C  0.86981 -1.905775 0.062756
C  1.317654 2.739874 -1.491425
C  3.916663 0.847433 -1.003177
C  -0.597343 -1.270768 -1.765548
C  -1.74969 1.009102 0.625401
C  4.209703 -0.905909 1.184411
C  0.046013 -3.015961 0.356814
C  5.146681 0.782444 -0.31684
C  -1.426071 -2.376908 -1.494521
C  5.283926 -0.082999 0.795942
C  -1.101984 -3.24903 -0.42348
C  -2.680685 1.674253 -0.185232
C  -2.059751 -0.104916 1.417158
C  -3.994598 1.165987 -0.223115
C  -3.382372 -0.594139 1.373848
C  -4.341717 0.034737 0.552949
H  1.603568 0.255136 -2.382388
H  2.293664 2.936961 -1.008532
H  0.646642 3.585222 -1.273938
H  1.45766 2.666123 -2.586485
H  3.82483 1.498919 -1.879448
H  -0.84942 -0.576027 -2.575081
H  4.294671 -1.612135 2.015277
H  0.330863 -3.679097 1.178985
H  5.9912 1.395932 -0.646468
H  -2.316009 -2.559979 -2.10497
H  6.231027 -0.132393 1.343387
H  -1.739139 -4.113133 -0.205942
H  -2.406897 2.560438 -0.763954
H  -1.294457 -0.569345 2.045811
H  -3.672186 -1.462729 1.971319
