program: Gaussian 09
title: 000233042
version: EM64L-G09RevD.01
frameworkgroup: C1[X(C15H13NO2)]
method: RPBEPBE
basis: SDD
operation: Freq
keyword: #p
keyword: freq=noraman
keyword: PBEPBE/SDD
title: #p freq=noraman PBEPBE/SDD
converged: YES YES NO NO
title: Mulliken charges:
elementType: O O N C C C C C C C C C C C C C C C H H H H H H H H H H H H H
charge: -0.277031 -0.280957 -0.358693 -0.309708 0.321504 0.349008 0.108694 0.106276 -0.373254 -0.371932 -0.358340 -0.357890 -0.260258 -0.263166 -0.219342 -0.219690 0.264058 -0.775447 0.290370 0.299705 0.251754 0.266155 0.259553 0.258676 0.231142 0.230947 0.233499 0.232774 0.254560 0.253729 0.213303
chargesum: 0.00000
title: Mulliken charges with hydrogens summed into heavy atoms:
elementType: O O N C C C C C C C C C C C C C C C
charge: -0.277031 -0.280957 -0.058988 -0.019338 0.321504 0.349008 0.108694 0.106276 -0.121499 -0.105777 -0.098786 -0.099214 -0.029117 -0.032219 0.014157 0.013085 0.264058 -0.053855
polarizability: 2.28070301e+02 5.89691365e+00 1.95631430e+02 6.16362017e+00 -1.87065222e+01 9.59682383e+01
1716.lowfreq: -2.1917 -0.0006 -0.0004 -0.0004 5.2813 9.1552 18.2346 33.6723 57.0968
frequency: 18.2116 33.3922 57.0699 69.5372 87.4619 120.7727 177.6068 223.6209 231.2823 251.1554 307.3613 315.4595 371.1636 400.8390 413.0869 462.8184 500.3615 520.0154 531.5244 540.6893 582.2917 594.9287 606.6445 612.5652 622.2289 661.2218 719.3080 726.7773 748.8810 766.1272 767.7209 828.9466 848.3954 867.2452 869.8662 893.7155 943.0142 955.5096 964.2007 976.6645 984.6442 986.2123 1030.2044 1032.8677 1040.9094 1048.9011 1090.7535 1111.4736 1168.2584 1169.3414 1173.8734 1208.4015 1210.7548 1227.2672 1240.2654 1245.3034 1284.3814 1317.6475 1334.9143 1387.0613 1390.9067 1392.3796 1443.6323 1446.3021 1449.1147 1458.1063 1470.9575 1474.6513 1482.5103 1581.5403 1601.7810 1606.7454 1611.5739 1632.1351 2997.0206 3003.9823 3097.3772 3101.8911 3128.8277 3130.6301 3141.3571 3141.7394 3159.5268 3159.8037 3173.2846 3173.6496 3544.4850
redmass: 4.3461 4.9099 1.5048 2.0718 4.6029 3.7453 6.7658 4.5551 4.6650 5.8255 4.3406 4.2830 6.4817 4.7115 3.2283 3.1727 3.4402 4.1121 4.6724 2.2785 3.3609 3.6142 1.9740 6.1863 5.7364 6.3245 4.5487 4.0082 4.8120 1.2913 1.2763 4.8148 4.8896 1.4474 1.4581 5.4967 2.1165 1.4080 2.0434 1.9093 1.3159 1.3185 2.2889 2.0047 1.6416 3.7088 2.1550 2.0591 1.0751 1.1152 2.4216 2.1554 2.7114 1.6518 2.0963 1.8360 1.4531 1.4970 1.6459 1.2373 5.8168 10.0144 2.4384 2.2867 1.0871 1.5278 1.3054 2.5401 2.5505 6.5712 7.5243 6.2571 6.8622 7.2730 1.0359 1.0825 1.0985 1.1003 1.0874 1.0873 1.0893 1.0898 1.0944 1.0945 1.0998 1.0999 1.0784
irintensity: 5.1280 1.3728 6.3711 1.9598 1.5661 0.1665 9.0203 1.8433 2.0631 0.7190 0.0065 0.1390 0.4661 0.5716 0.5778 2.6701 34.3756 0.3551 10.6971 24.6138 28.8724 12.0598 21.9844 1.0910 13.4876 0.6425 2.4588 1.4277 5.3836 163.6572 15.6085 4.8260 2.5569 1.0272 1.2097 35.3333 6.1220 0.3802 2.5156 1.4705 0.0977 0.1160 0.5970 13.3522 8.5977 33.7203 31.7445 12.5851 0.8707 3.5013 0.7710 125.6223 23.0058 24.1625 140.1401 133.2471 0.7751 69.1181 5.0662 70.2000 3.9934 1.3773 106.6873 2.1352 26.0151 247.2677 55.8879 147.9801 4.0526 47.8610 6.3689 180.9967 28.2111 0.4240 10.6575 15.3075 9.8526 16.5883 1.2661 0.0452 8.9348 8.8198 22.8478 11.7769 27.0292 5.8523 14.9681
temp: 298.150 k
press: 1.00000 atm
elementType: 8 8 7 6 6 6 6 6 6 6 6 6 6 6 6 6 6 6 1 1 1 1 1 1 1 1 1 1 1 1 1
symmnumber: 1
zpe: 636886.0 jmol-1
zpe.correction: 0.242577 hartree
zpe.thermalcorrener: 0.257594 hartree
zpe.thermalcorrenthalpy: 0.258538 hartree
zpe.thermalcorrgfe: 0.198417 hartree
zpe.sumelectzpe: -783.358781 hartree
zpe.sumelectthermal: -783.343764 hartree
zpe.sumelectthermalent: -783.342820 hartree
zpe.sumelectthermalfe: -783.402942 hartree
dipole: 0.7829 -0.4045 2.9834
dipole: 3.1108
quadrupole: -91.6488 -102.3513 -108.0938
quadrupole: 5.3122 -2.9477 7.6787
quadrupole: 9.0492 -1.6533 -7.3958 5.3122 -2.9477 7.6787
hfenergy: -783.6013584 hartree
pointgroup: C01 [X(C15H13N1O2)]
dipole: 0.3419239 0.1231418 -1.1686977 debye
polarizability: 226.8176017|-8.7036455|196.9684667|-5.7613182|-18.5553315|95.8839007 unknown
InChI: InChI=1S/C15H13NO2/c1-10(17)16-15-11-6-2-4-8-13(11)18-14-9-5-3-7-12(14)15/h2-9,15-16H,1H3
charge 0 multiplicity 1
31 atoms
O  0.838186 2.018237 -0.454078
O  -1.560252 -3.073497 1.040408
N  -0.550376 -1.711863 -0.552833
C  -0.182044 -0.64515 0.418667
C  1.298316 -0.303766 0.296514
C  -1.065456 0.587747 0.247099
C  1.732558 0.969567 -0.144714
C  -0.539246 1.823795 -0.196029
C  2.288378 -1.270648 0.602141
C  -2.45677 0.513962 0.506617
C  3.103053 1.274645 -0.300839
C  -1.362294 2.952428 -0.402945
C  3.660815 -0.984993 0.459617
C  -3.295185 1.630042 0.313452
C  4.066925 0.29377 0.000288
C  -2.743829 2.851809 -0.149413
C  -1.222337 -2.861765 -0.166578
C  -1.52922 -3.853777 -1.283659
H  -0.390439 -1.111027 1.401649
H  -0.318095 -1.560012 -1.536448
H  1.96393 -2.258714 0.949672
H  -2.871439 -0.437105 0.861156
H  3.385028 2.27323 -0.647523
H  -0.905549 3.884168 -0.749578
H  4.408953 -1.746094 0.703542
H  -4.367239 1.553805 0.521858
H  5.131012 0.525631 -0.11589
H  -3.388045 3.723857 -0.304788
H  -1.10753 -4.837605 -1.015695
H  -2.623024 -3.979467 -1.363808
H  -1.131785 -3.54871 -2.266964
