program: Gaussian 09
title: 000233037
version: EM64L-G09RevD.01
frameworkgroup: C1[X(C14H15NO2S2)]
method: RPBEPBE
basis: SDD
operation: Freq
keyword: #p
keyword: freq=noraman
keyword: PBEPBE/SDD
title: #p freq=noraman PBEPBE/SDD
converged: YES YES NO NO
title: Mulliken charges:
elementType: S S O O N C C C C C C C C C C C C C C H H H H H H H H H H H H H H H
charge: 0.272393 0.100085 -0.290874 -0.267660 -0.090504 -0.330709 -0.290217 0.300943 0.252216 -0.158012 -0.517594 0.224436 -0.657603 -0.338698 -0.380349 -0.281031 -0.222749 -0.244510 -0.682393 0.247049 0.245148 0.262884 0.239880 0.237833 0.222932 0.321943 0.249629 0.234625 0.229840 0.215096 0.214592 0.212744 0.234292 0.234342
chargesum: 0.00000
title: Mulliken charges with hydrogens summed into heavy atoms:
elementType: S S O O N C C C C C C C C C C C C C C
charge: 0.272393 0.100085 -0.290874 -0.267660 -0.090504 0.161488 -0.290217 0.300943 0.252216 0.104872 -0.517594 0.224436 0.043042 -0.016755 -0.130720 -0.046405 0.007091 0.185178 -0.001015
polarizability: 4.17591861e+02 4.89917920e+01 2.34201299e+02 3.66750068e+00 -2.06830058e+00 9.50507180e+01
1716.lowfreq: -3.8095 -0.0022 -0.0017 -0.0006 4.8516 8.5189 23.4512 38.8167 60.1988
frequency: 23.3440 38.7897 60.1794 68.2270 76.7472 89.9516 98.2025 129.6826 136.1393 161.3223 196.2693 203.1338 213.2667 227.1366 245.1542 268.2173 305.3371 330.2695 346.8460 361.0997 402.3666 412.5738 437.5964 482.7634 488.5476 519.8597 533.4581 558.2096 574.5342 591.7580 598.5137 730.7191 739.7186 752.9198 755.5837 768.7464 803.6588 813.4665 828.1079 871.7701 884.9253 908.9589 948.5067 955.6363 967.2653 990.6993 1018.8569 1032.2884 1050.3008 1057.1312 1093.4125 1103.1814 1117.2880 1119.9389 1135.7806 1180.2721 1210.0698 1219.5739 1239.8132 1264.2736 1287.2154 1323.0049 1343.7964 1348.0860 1371.7303 1374.3916 1388.3898 1402.2149 1410.3509 1443.5701 1448.2316 1462.6402 1467.8761 1471.8493 1480.6063 1482.1691 1491.8239 1566.1113 1572.5097 1592.2242 1609.4044 2964.5819 2994.5874 2998.6454 3025.8398 3030.3840 3088.6242 3094.0354 3096.1873 3104.1135 3107.9869 3112.0256 3133.7981 3151.2018 3163.0927 3174.2253
redmass: 4.7713 6.4434 3.2106 4.0366 4.2931 7.7163 2.6691 2.5004 4.7844 5.3161 6.4331 4.9652 1.3333 3.2498 1.2034 5.0848 4.6151 3.4307 3.5187 4.1119 6.2195 17.4059 5.2335 3.5020 5.0423 16.5066 3.4776 7.1966 6.1161 5.7870 5.8907 5.8081 2.4085 4.5424 3.9644 1.3271 2.0137 4.3088 1.1045 1.3538 3.8739 3.5606 1.4197 4.5298 1.3604 3.5518 1.3186 2.7904 3.1508 3.1010 2.1197 2.5018 2.2004 2.2018 1.4339 1.0979 2.3291 2.7169 2.6361 1.1407 2.6800 1.6264 2.1179 1.5123 1.5835 1.6546 1.2120 1.2922 1.9101 2.2894 1.1359 1.0398 1.7791 1.0463 1.1291 1.0508 1.1666 8.0381 6.3909 7.1152 6.0707 1.0555 1.0353 1.0363 1.1079 1.0593 1.1028 1.0989 1.0988 1.0862 1.1017 1.1044 1.0866 1.0917 1.0958 1.0975
irintensity: 0.5251 0.3832 0.2598 0.7529 0.1328 6.3789 1.1173 0.7480 0.8621 0.9589 0.4883 0.6714 0.7427 1.1070 1.1196 5.7951 0.4617 3.0194 10.6018 2.0349 8.3945 2.2634 0.5856 7.1923 40.7324 0.4959 0.7509 11.1161 11.7652 8.7755 9.1745 10.1317 17.0768 3.8092 7.1445 94.3998 7.6404 13.5922 0.6260 0.0183 32.9927 48.5388 9.8445 12.2774 5.4395 2.8678 2.7547 84.5642 6.4462 78.5432 34.5548 27.6677 12.0305 256.7134 4.8363 51.7436 240.7174 350.4209 143.2991 0.1309 45.4625 11.6936 18.7016 111.8637 101.7759 15.1340 21.3276 43.2112 191.6560 29.9993 71.5387 13.3210 93.1663 9.0062 3.6359 6.9505 8.0217 50.4471 132.9417 87.5127 93.9052 55.4456 24.0058 19.6476 28.9537 16.5000 2.4695 36.8355 31.6964 14.8753 31.9946 8.7933 5.3000 19.9839 23.3652 44.3992
temp: 298.150 k
press: 1.00000 atm
elementType: 16 16 8 8 7 6 6 6 6 6 6 6 6 6 6 6 6 6 6 1 1 1 1 1 1 1 1 1 1 1 1 1 1 1
symmnumber: 1
zpe: 683784.8 jmol-1
zpe.correction: 0.260440 hartree
zpe.thermalcorrener: 0.279461 hartree
zpe.thermalcorrenthalpy: 0.280405 hartree
zpe.thermalcorrgfe: 0.211527 hartree
zpe.sumelectzpe: -1542.427915 hartree
zpe.sumelectthermal: -1542.408894 hartree
zpe.sumelectthermalent: -1542.407950 hartree
zpe.sumelectthermalfe: -1542.476829 hartree
dipole: 5.9133 0.8093 0.3409
dipole: 5.9782
quadrupole: -104.6873 -125.3577 -129.7347
quadrupole: -16.1381 0.1351 -0.6977
quadrupole: 15.2393 -5.4312 -9.8081 -16.1381 0.1351 -0.6977
hfenergy: -1542.6883553 hartree
pointgroup: C01 [X(C14H15N1O2S2)]
dipole: 2.297606 -0.5014426 -0.037927 debye
polarizability: 426.2998541|-30.0091341|161.9868401|14.5932507|62.3096836|158.5571834 unknown
InChI: InChI=1S/C14H15NO2S2/c1-3-15-13(16)12(19-14(15)18)9-10-7-5-6-8-11(10)17-4-2/h5-9H,3-4H2,1-2H3
charge 0 multiplicity 1
34 atoms
S  -2.65931 -1.120488 -0.965138
S  -5.568866 -0.161723 -0.526244
O  2.173541 -2.080048 -1.15246
O  -1.270215 1.491963 1.681911
N  -3.294722 0.803298 0.714553
C  -4.060115 1.776823 1.533996
C  -1.297165 -0.311067 -0.010233
C  -1.873432 0.727077 0.871008
C  1.302152 -0.364153 0.305786
C  -0.00176 -0.743079 -0.226371
C  -3.920568 -0.063234 -0.177828
C  2.44625 -1.087915 -0.204347
C  -4.531467 1.160431 2.865065
C  1.545833 0.653646 1.277134
C  3.753426 -0.791729 0.244421
C  2.849168 0.944351 1.721496
C  3.950806 0.223348 1.206069
C  3.298296 -2.854747 -1.721915
C  2.693364 -3.847954 -2.709678
H  -3.383705 2.628508 1.716905
H  -4.92064 2.104669 0.92672
H  0.083408 -1.552675 -0.964648
H  -5.19789 0.299721 2.684663
H  -3.670967 0.831456 3.472484
H  -5.092314 1.916294 3.443527
H  0.688486 1.20605 1.670185
H  4.615681 -1.340062 -0.143952
H  3.005717 1.730315 2.467073
H  4.967026 0.446966 1.549884
H  4.000603 -2.159547 -2.224604
H  3.833633 -3.374211 -0.901727
H  3.493836 -4.456392 -3.168151
H  1.988248 -4.526274 -2.200041
H  2.152366 -3.320619 -3.513644
