program: Gaussian 09
title: 000233024
version: EM64L-G09RevD.01
frameworkgroup: C1[X(C7H7Br2NO2S)]
method: RPBEPBE
basis: SDD
operation: Freq
keyword: #p
keyword: freq=noraman
keyword: PBEPBE/SDD
title: #p freq=noraman PBEPBE/SDD
converged: YES YES NO NO
title: Mulliken charges:
elementType: Br Br S O O N C C C C C C C H H H H H H H
charge: 0.067121 0.051195 0.923169 -0.528425 -0.500344 -0.480888 0.058558 -0.212148 -0.186325 -0.198686 -0.160037 -0.183084 -0.589283 0.326570 0.329778 0.265338 0.263882 0.241821 0.265094 0.246693
chargesum: 0.00000
title: Mulliken charges with hydrogens summed into heavy atoms:
elementType: Br Br S O O N C C C C C C C
charge: 0.067121 0.051195 0.923169 -0.528425 -0.500344 -0.151111 0.058558 -0.212148 0.140245 -0.198686 0.105301 0.080797 0.164326
polarizability: 2.14509654e+02 7.38720855e+00 1.46667133e+02 -2.63833036e-01 -1.19913390e+00 8.56519309e+01
1716.lowfreq: -35.4368 -7.5791 -5.3292 -0.0010 -0.0008 0.0004 6.1879 41.3474 69.6624
frequency: -35.3856 41.3070 69.6620 81.0270 101.4222 126.0947 134.3714 185.2035 195.1067 203.7634 213.5393 267.2226 270.1658 288.0081 332.8424 365.5202 415.6334 448.3286 454.9936 481.8486 554.2277 636.9325 698.2255 719.0730 784.5957 804.7154 822.9249 924.1916 937.5680 964.5807 971.9506 1001.5396 1067.1344 1083.2418 1087.4271 1100.2754 1138.8433 1241.0719 1330.1427 1337.1675 1377.0282 1414.7955 1423.9813 1449.1839 1480.8123 1551.2609 1566.3554 2976.6499 3068.7673 3113.4770 3150.7648 3162.8633 3181.8398 3373.6547
redmass: 2.0273 5.3735 8.8357 2.7852 10.0959 16.1662 1.7503 5.8459 5.6079 52.8936 7.3703 8.7973 9.0143 5.8242 4.0802 6.7859 6.6265 4.3891 7.2111 6.3487 5.5266 7.4508 4.2409 7.7613 1.4492 12.7445 1.3297 1.3747 8.7356 1.3594 7.5112 3.2598 6.0885 1.8265 1.4447 1.4187 1.4147 1.3052 1.2147 3.0564 6.0007 1.1081 2.2683 1.0520 1.0516 7.8291 7.5025 1.0359 1.1004 1.0991 1.0922 1.0891 1.0976 1.0751
irintensity: 2.6753 1.0479 0.2363 2.3049 1.0002 0.4069 1.2399 1.4313 0.8215 0.0382 2.8895 1.9341 7.8878 9.9339 14.8899 18.3922 36.8036 39.4164 19.3976 93.3215 1.8466 3.3198 2.1226 5.1569 125.1351 62.0926 38.5159 15.3424 59.2846 0.7135 100.5264 5.3636 22.7077 38.3844 16.2475 14.8686 10.4988 15.7552 0.5873 8.4485 6.8079 12.7177 130.0096 11.0822 16.8191 5.4461 10.7203 42.4804 18.4595 7.9389 19.9453 0.4208 2.2766 16.3832
temp: 298.150 k
press: 1.00000 atm
elementType: 35 35 16 8 8 7 6 6 6 6 6 6 6 1 1 1 1 1 1 1
symmnumber: 1
zpe: 335991.1 jmol-1
zpe.correction: 0.127972 hartree
zpe.thermalcorrener: 0.141896 hartree
zpe.thermalcorrenthalpy: 0.142840 hartree
zpe.thermalcorrgfe: 0.084958 hartree
zpe.sumelectzpe: -899.959180 hartree
zpe.sumelectthermal: -899.945256 hartree
zpe.sumelectthermalent: -899.944312 hartree
zpe.sumelectthermalfe: -900.002194 hartree
dipole: 0.0815 -1.9873 3.8459
dipole: 4.3298
quadrupole: -96.5402 -97.4021 -108.7758
quadrupole: -6.7164 -9.3019 7.1638
quadrupole: 4.3658 3.5039 -7.8697 -6.7164 -9.3019 7.1638
hfenergy: -900.0871521 hartree
pointgroup: C01 [X(C7H7Br2N1O2S1)]
dipole: -0.5276921 -0.7603923 -1.4300906 debye
dipolederiv: -0.2505978 0.3281692 0.0359322 0.259432 -0.3446032 -0.032894 0.0510688 -0.0535941 0.0290447 -0.5065458 0.3082723 0.0457974 0.3892612 -0.3098404 -0.0413274 0.0344175 -0.0279604 -0.0073517 1.8625028 0.3666973 -0.1940454 0.3096769 1.2185297 -0.050979 -0.078238 -0.060757 1.3691898 -0.652867 -0.0620178 0.090594 -0.0679539 -0.662188 -0.0978126 0.031976 0.0202343 -0.4994523 -0.7004508 -0.0579441 -0.0837202 -0.0625135 -0.4858221 0.170141 -0.0107614 0.0510547 -0.6828936 -0.4934266 -0.1229215 0.0971632 -0.1402193 -0.4837418 -0.0692814 0.0744966 -0.0197587 -0.3994634 -0.1646695 0.1724137 -0.0217487 -0.0577826 -0.2615267 -0.0089702 -0.0756387 -0.0129726 -0.1347986 0.2968696 -0.801182 -0.0517905 -0.2457628 0.6345537 0.0645252 -0.0417142 0.0928261 -0.0872589 -0.4429394 0.1757714 0.0387694 -0.0220805 -0.2726938 -0.0038425 -0.0002343 -0.0253902 -0.0331395 0.9067919 -0.7169188 -0.0906536 -0.6744709 0.5268949 0.0797317 -0.0509768 0.061629 -0.1114366 -0.1617703 0.1917451 0.0151696 0.0848809 -0.1127699 0.0062331 0.0159128 -0.0091684 -0.0668718 -0.1263553 0.2206141 0.0365843 0.1194835 -0.1054907 -0.0064657 0.0073606 -0.0016159 -0.0747135 0.1101004 0.0489522 0.0800242 0.2659561 0.2739279 -0.2162887 0.0398408 0.0106273 0.0425789 0.1956407 0.0003359 -0.0178475 0.0439262 0.1005431 -0.0089789 -0.0064446 -0.0011416 0.1523685 0.1245043 0.0553604 -0.0116207 0.0251566 0.1695167 0.1015059 0.0433884 0.1067294 0.0565544 0.0479379 -0.015549 0.0007578 -0.0232916 -0.029979 -0.0199465 -0.0030424 -0.0217236 0.158952 -0.0264869 -0.0299814 -0.003407 -0.0251389 0.0877948 -0.0080451 -0.0051747 -0.0073449 0.1604856 -0.0775724 -0.1167819 -0.0228973 -0.1710384 -0.0355117 0.0746348 -0.0799085 -0.0330715 0.0513488 -0.02722 0.0830422 -0.0309282 0.0377898 0.0394485 0.0495718 -0.0264207 -0.0405604 0.1540437 0.0865542 -0.0280774 0.0878672 -0.0453108 0.0529582 0.0184886 0.080093 -0.0280416 -0.0771866 unknown
polarizability: 196.5657629|-30.0167147|163.192974|-12.5149412|1.9452962|87.0699814 unknown
InChI: InChI=1S/C7H7Br2NO2S/c1-10-13(11,12)7-4-5(8)2-3-6(7)9/h2-4,10H,1H3
charge 0 multiplicity 1
20 atoms
Br 0.925074 -2.89011 -0.140414
Br -4.017174 1.645821 0.321331
S  1.551379 0.570623 0.295433
O  1.321131 2.182555 0.402471
O  2.427066 -0.228347 1.406581
N  2.242643 0.189799 -1.408043
C  -0.207616 -0.168614 0.1615
C  -0.470734 -1.541709 0.010964
C  -1.232118 0.78987 0.256455
C  -2.566009 0.342854 0.195531
C  -1.818105 -1.966439 -0.045944
C  -2.868689 -1.027114 0.046977
C  2.627389 1.410221 -2.165428
H  -0.964665 1.845155 0.376956
H  3.038391 -0.446712 -1.20942
H  -2.047519 -3.029078 -0.164641
H  -3.90701 -1.366626 0.002473
H  3.465098 1.986718 -1.728163
H  1.755109 2.076226 -2.254542
H  2.905658 1.066607 -3.178376
