program: Gaussian 09
title: 000233003
version: EM64L-G09RevD.01
frameworkgroup: C1[X(C16H14BrNO3)]
method: RPBEPBE
basis: SDD
operation: Freq
keyword: #p
keyword: freq=noraman
keyword: PBEPBE/SDD
title: #p freq=noraman PBEPBE/SDD
converged: YES YES NO NO
title: Mulliken charges:
elementType: Br O O O N C C C C C C C C C C C C C C C C H H H H H H H H H H H H H H
charge: -0.024802 -0.274282 -0.295571 -0.289991 -0.355782 -0.325477 0.346427 0.333768 0.101605 0.102011 -0.352259 -0.363600 -0.356967 -0.356673 -0.262976 -0.261311 -0.219905 -0.218822 0.310500 -0.248460 -0.627034 0.287891 0.325016 0.256776 0.248452 0.259279 0.260065 0.232603 0.231229 0.233502 0.233807 0.230587 0.276617 0.272680 0.291099
chargesum: 0.00000
title: Mulliken charges with hydrogens summed into heavy atoms:
elementType: Br O O O N C C C C C C C C C C C C C C C C
charge: -0.024802 -0.274282 -0.295571 -0.289991 -0.030766 -0.037586 0.346427 0.333768 0.101605 0.102011 -0.095483 -0.115148 -0.097688 -0.096608 -0.030373 -0.030082 0.013597 0.014986 0.310500 0.258744 -0.063256
polarizability: 2.34161082e+02 1.80195869e+01 2.54823559e+02 2.86978377e+01 -3.58071117e+00 1.14844429e+02
1716.lowfreq: -3.6656 -0.0003 -0.0001 0.0004 3.2139 7.0889 11.5860 13.3393 25.2330
frequency: 11.2899 12.7065 25.2137 35.5004 56.1063 76.0140 112.2191 122.7126 155.0702 184.8397 222.9756 234.8392 252.0119 298.5663 303.2627 324.8386 370.2095 396.8462 402.8564 436.0021 461.5286 508.4454 520.2809 535.3155 556.2397 573.3217 594.3666 596.6722 620.0767 650.5269 670.7060 691.3040 712.9632 725.4231 753.7160 766.9256 767.8874 801.6243 829.4092 857.5258 867.7530 869.6461 892.5291 917.0885 950.2776 954.7030 974.7913 982.4755 984.7024 986.6964 1031.1759 1033.9128 1050.8154 1089.4212 1091.4865 1115.8738 1168.4732 1169.2310 1173.6960 1175.1238 1184.7841 1208.3605 1212.9496 1216.3584 1229.2553 1243.5140 1277.9225 1284.7884 1318.6640 1326.0970 1356.6794 1390.4865 1393.4783 1427.3497 1442.1429 1447.4139 1461.0063 1473.1756 1474.9063 1483.2932 1581.9606 1603.0606 1612.3624 1632.7247 1666.2288 2989.8736 3009.1569 3056.2473 3075.3321 3129.4847 3130.3754 3141.8181 3141.9393 3143.4582 3160.1185 3160.4902 3173.7174 3174.0710 3556.2690
redmass: 9.7843 7.5706 5.1899 9.3766 11.4636 4.6243 4.1874 4.3013 7.3639 5.1346 4.6963 4.0331 5.1852 4.7228 4.3491 3.7896 6.5790 3.7062 4.7319 3.3642 3.2001 3.7474 4.0352 3.8178 2.8763 4.2173 1.8985 5.2443 4.0681 6.8405 6.1150 11.3093 4.3188 3.9187 3.6127 1.3383 1.3396 3.1674 4.7835 2.2788 1.4884 1.6233 5.5737 2.5687 1.5388 1.3992 2.6847 1.7266 1.3638 1.4572 2.2756 2.0021 2.9822 4.0933 2.1902 2.1749 1.0817 1.1544 1.7347 1.9431 1.9267 2.0710 2.0370 1.3569 1.7881 2.0700 1.1729 1.4491 1.3055 1.6266 1.3061 6.6954 10.4611 1.1073 2.4833 2.4921 1.1703 1.6639 2.5362 2.4531 6.6534 7.5514 6.8539 7.2658 9.6830 1.0612 1.0829 1.0597 1.0995 1.0873 1.0877 1.0893 1.0894 1.1095 1.0944 1.0944 1.0999 1.0999 1.0777
irintensity: 0.1438 0.8747 0.7198 0.8387 5.2025 3.2521 0.1545 0.9618 0.6527 2.1039 1.8914 5.3427 0.0850 3.0129 1.2859 26.8661 0.8730 8.2570 0.8918 9.4608 3.5150 20.0866 0.0250 10.6093 12.5182 16.7276 51.0375 7.7661 31.8291 1.0222 3.3807 17.0889 5.1758 1.6359 19.0986 66.2354 109.8995 0.5423 3.3277 15.2401 1.4186 3.0173 35.6429 18.7431 43.2109 5.6949 56.8031 66.4264 9.9324 26.0499 0.3426 11.9323 6.9946 145.2995 35.8544 48.1143 4.8876 28.4634 29.2500 2.1253 245.3134 100.3646 1.8354 3.1993 45.2749 213.0612 32.5547 0.7759 64.4947 6.6755 2.6454 5.8859 0.8382 12.9884 122.5995 4.1328 74.7962 348.6769 141.6282 21.8845 46.9265 8.8497 26.7953 0.8770 309.1083 42.4810 5.1491 23.3412 4.2969 1.3077 0.6377 6.5968 12.9633 6.5505 20.5938 12.2516 26.2857 5.4999 32.6632
temp: 298.150 k
press: 1.00000 atm
elementType: 35 8 8 8 7 6 6 6 6 6 6 6 6 6 6 6 6 6 6 6 6 1 1 1 1 1 1 1 1 1 1 1 1 1 1
symmnumber: 1
zpe: 698018.2 jmol-1
zpe.correction: 0.265861 hartree
zpe.thermalcorrener: 0.284210 hartree
zpe.thermalcorrenthalpy: 0.285154 hartree
zpe.thermalcorrgfe: 0.214286 hartree
zpe.sumelectzpe: -910.511813 hartree
zpe.sumelectthermal: -910.493464 hartree
zpe.sumelectthermalent: -910.492520 hartree
zpe.sumelectthermalfe: -910.563388 hartree
dipole: -0.1128 -1.9620 -2.0177
dipole: 2.8167
quadrupole: -121.0423 -112.9275 -137.3774
quadrupole: -6.3309 -0.0576 2.9088
quadrupole: 2.7401 10.8549 -13.5950 -6.3309 -0.0576 2.9088
hfenergy: -910.7776738 hartree
pointgroup: C01 [X(C16H14Br1N1O3)]
dipole: 0.1804463 -0.8185759 -0.7248352 debye
polarizability: 225.3948156|12.2760224|262.5111463|29.1485809|-7.8776399|115.9231085 unknown
InChI: InChI=1S/C16H14BrNO3/c17-9-10-20-16(19)18-15-11-5-1-3-7-13(11)21-14-8-4-2-6-12(14)15/h1-8,15,18H,9-10H2
charge 0 multiplicity 1
35 atoms
Br 4.992541 1.991172 -0.340768
O  -2.91704 0.329624 -0.65676
O  3.205309 -0.870701 -0.378942
O  2.380497 -0.493601 1.810091
N  0.982335 -0.51817 -0.079302
C  -0.282761 -0.224043 0.642019
C  -0.79248 1.17764 0.309482
C  -1.331274 -1.294273 0.350822
C  -2.039797 1.387176 -0.324049
C  -2.558274 -0.983199 -0.282383
C  -0.004664 2.315503 0.61495
C  -1.091201 -2.64649 0.6999
C  -2.494276 2.680733 -0.663031
C  -3.515192 -1.979933 -0.577689
C  -0.441714 3.614872 0.290855
C  -2.034385 -3.654759 0.420178
C  -1.691291 3.795178 -0.354931
C  -3.25052 -3.316821 -0.226375
C  2.186121 -0.607641 0.571889
C  4.585275 -0.892552 0.140601
C  5.452604 0.047429 -0.683352
H  0.006019 -0.263523 1.709916
H  0.973611 -0.587384 -1.098641
H  0.964513 2.167205 1.106094
H  -0.144366 -2.899693 1.191449
H  -3.465047 2.787351 -1.156057
H  -4.446298 -1.686571 -1.071435
H  0.182457 4.48019 0.535566
H  -1.829325 -4.692734 0.701125
H  -2.03808 4.801246 -0.613909
H  -3.989969 -4.092897 -0.450933
H  4.961593 -1.927217 0.01475
H  4.577031 -0.634127 1.214017
H  6.515666 -0.05529 -0.413639
H  5.306975 -0.096096 -1.76421
