program: Gaussian 09
title: 000233008
version: EM64L-G09RevD.01
frameworkgroup: C1[X(C18H19NO3)]
method: RPBEPBE
basis: SDD
operation: Freq
keyword: #p
keyword: freq=noraman
keyword: PBEPBE/SDD
title: #p freq=noraman PBEPBE/SDD
converged: YES YES NO NO
title: Mulliken charges:
elementType: O O O N C C C C C C C C C C C C C C C C C C H H H H H H H H H H H H H H H H H H H
charge: -0.275252 -0.298261 -0.292850 -0.368346 -0.316063 0.344541 0.330150 0.101327 0.102400 -0.363911 -0.363343 -0.357252 -0.357432 -0.263479 -0.262201 0.286088 -0.369492 -0.219766 -0.219477 -0.254253 -0.344685 -0.686901 0.286116 0.320148 0.254598 0.249987 0.259149 0.259453 0.230638 0.230764 0.207587 0.206913 0.232936 0.233208 0.222833 0.218688 0.196670 0.196689 0.211836 0.211814 0.218431
chargesum: 0.00000
title: Mulliken charges with hydrogens summed into heavy atoms:
elementType: O O O N C C C C C C C C C C C C C C C C C C
charge: -0.275252 -0.298261 -0.292850 -0.048198 -0.029947 0.344541 0.330150 0.101327 0.102400 -0.109313 -0.113356 -0.098103 -0.097979 -0.032841 -0.031437 0.286088 0.045007 0.013170 0.013731 0.187268 0.048674 -0.044821
polarizability: 2.48533612e+02 1.35779572e+00 2.55478197e+02 -3.30898994e+01 9.80775694e-02 1.35572355e+02
1716.lowfreq: -13.1175 -6.7767 0.0003 0.0004 0.0008 3.8176 4.3648 25.1571 27.4351
frequency: -12.8238 24.9022 26.9135 51.5058 58.0304 61.4087 96.4915 111.8545 116.2384 145.5747 156.5466 187.4758 225.6606 234.3961 236.4516 265.0078 273.7013 303.9007 353.2975 374.3406 402.8561 407.3373 451.1604 460.4853 513.5241 520.6574 555.4562 582.3625 588.2955 597.2997 618.9484 652.7067 678.8121 697.6216 718.6929 725.5932 742.0560 757.3041 766.3737 768.3611 800.1547 829.3107 841.8869 866.5285 867.2092 892.4883 900.1165 924.7595 933.8157 950.3261 952.6179 982.2558 983.8955 987.4782 1030.8193 1033.6218 1040.3754 1078.4541 1083.7806 1091.3244 1116.4258 1124.3550 1149.9594 1168.2348 1168.9206 1175.0031 1186.6386 1208.4807 1213.0774 1214.6289 1228.4786 1242.3951 1271.3975 1274.0571 1284.1075 1287.1288 1318.1523 1327.1419 1347.4533 1375.4002 1390.7119 1393.4708 1394.4089 1442.5155 1447.6634 1466.5999 1471.1608 1474.4684 1475.1477 1478.7920 1481.8824 1484.8068 1492.9756 1581.9129 1602.8504 1612.4481 1632.8533 1644.1946 2970.6767 2976.9655 2991.3763 3000.3101 3002.3459 3013.8594 3043.8764 3069.8020 3077.0306 3078.4913 3129.5144 3129.6970 3141.6594 3142.0030 3159.5429 3159.9409 3173.4934 3173.9437 3558.9657
redmass: 5.0849 4.8882 4.6870 4.9464 2.9352 2.2327 4.7224 2.3194 3.2074 3.2973 5.1141 4.5738 4.7191 1.1782 4.5915 6.0479 5.4952 4.5399 4.6369 5.9142 4.7340 3.0785 3.9072 3.1734 3.8851 4.0357 2.4178 4.6297 1.8842 5.7913 4.9085 6.8667 6.9824 11.4671 4.3051 3.8854 1.0716 2.7187 1.2774 1.6874 1.1381 4.7200 4.7754 1.5065 1.4814 5.5823 2.1750 3.6648 1.1627 1.5155 1.3851 1.7603 1.3178 2.7225 2.2724 1.9969 3.3964 4.7275 2.5109 2.1761 2.1350 2.6078 1.4882 1.0748 1.1172 2.6388 2.1165 2.0749 1.3631 2.6563 1.7516 2.1071 1.1592 1.2938 1.4525 1.0835 1.3213 1.6310 1.4379 1.4821 6.5779 8.8355 1.2433 2.4845 2.5029 1.5510 1.1222 2.4649 1.1350 1.0425 2.0783 1.2040 1.1145 6.6623 7.5691 6.8682 7.2695 9.8434 1.0586 1.0368 1.0598 1.0569 1.0825 1.1004 1.1037 1.1045 1.0994 1.1044 1.0872 1.0872 1.0894 1.0894 1.0944 1.0945 1.0998 1.0999 1.0777
irintensity: 1.4974 0.6821 1.4473 1.0869 3.1825 0.0847 0.4972 0.0592 0.2985 3.6086 1.7922 0.7843 0.2416 0.3980 8.7751 13.0784 0.5487 0.2907 0.3462 0.1476 0.7405 8.9508 13.4336 3.3232 12.6868 0.0468 20.8117 16.8185 57.6358 5.7251 23.9587 1.1566 2.1633 16.6910 4.1814 1.5103 8.2487 49.3003 0.5922 141.1209 0.4834 3.9393 10.9379 0.4460 1.0507 35.8337 26.2534 8.0444 0.6921 35.9361 1.1111 53.4067 0.2088 99.1060 0.5391 12.6249 36.0768 86.4690 1.2513 31.8070 30.1609 1.9769 2.0139 0.9237 27.9269 1.7856 399.4854 104.8390 0.5881 11.3601 40.0315 222.3782 0.4928 2.5993 0.9788 0.1138 105.4502 9.0610 1.3273 18.8457 6.0200 0.6994 7.0272 124.6104 2.9993 335.9113 36.1347 142.6882 51.3425 13.5239 4.1322 13.3681 34.4772 48.2242 8.6027 25.8577 0.9937 287.1359 27.6469 32.3329 11.2496 57.3127 7.1534 6.5543 1.3370 0.1476 51.0085 124.6502 0.1280 1.7785 8.0511 11.3719 21.5969 13.8100 25.0207 8.1110 29.5427
temp: 298.150 k
press: 1.00000 atm
elementType: 8 8 8 7 6 6 6 6 6 6 6 6 6 6 6 6 6 6 6 6 6 6 1 1 1 1 1 1 1 1 1 1 1 1 1 1 1 1 1 1 1
symmnumber: 1
zpe: 868636.1 jmol-1
zpe.correction: 0.330846 hartree
zpe.thermalcorrener: 0.350148 hartree
zpe.thermalcorrenthalpy: 0.351092 hartree
zpe.thermalcorrgfe: 0.281252 hartree
zpe.sumelectzpe: -976.170269 hartree
zpe.sumelectthermal: -976.150967 hartree
zpe.sumelectthermalent: -976.150023 hartree
zpe.sumelectthermalfe: -976.219863 hartree
dipole: -1.0262 0.1989 -1.7332
dipole: 2.0240
quadrupole: -115.6823 -113.5124 -137.3018
quadrupole: 0.1883 -1.8844 0.8230
quadrupole: 6.4832 8.6531 -15.1363 0.1883 -1.8844 0.8230
hfenergy: -976.5011149 hartree
pointgroup: C01 [X(C18H19N1O3)]
dipole: -0.4004428 0.0607133 -0.6856288 debye
polarizability: 248.8806819|0.6077886|255.4341845|-32.4804373|-2.7223485|135.2692969 unknown
InChI: InChI=1S/C18H19NO3/c1-2-3-12-21-18(20)19-17-13-8-4-6-10-15(13)22-16-11-7-5-9-14(16)17/h4-11,17,19H,2-3,12H2,1H3
charge 0 multiplicity 1
41 atoms
O  3.414114 0.005964 -0.758826
O  -2.827118 -0.033129 -0.221276
O  -1.83903 -0.145617 1.919987
N  -0.561115 0.031381 -0.046415
C  0.762264 0.029222 0.622734
C  1.547225 -1.241545 0.301222
C  1.551967 1.287266 0.269908
C  2.791677 -1.202005 -0.370629
C  2.797379 1.224754 -0.399352
C  1.032185 -2.510438 0.665124
C  1.042089 2.567821 0.598501
C  3.501558 -2.38001 -0.692433
C  3.513087 2.391521 -0.749107
C  1.726986 -3.697454 0.360647
C  1.742494 3.743755 0.265403
C  -1.736664 -0.057574 0.665707
C  -5.20808 0.019639 -0.689763
C  2.965907 -3.62913 -0.326023
C  2.982853 3.652052 -0.415967
C  -4.168232 -0.126698 0.421231
C  -6.650648 -0.0717 -0.136904
C  -7.715589 0.082262 -1.243768
H  0.510938 0.03845 1.701252
H  -0.610621 0.081558 -1.065429
H  0.071207 -2.553459 1.191368
H  0.07819 2.629095 1.117464
H  4.457728 -2.293455 -1.216925
H  4.469616 2.287026 -1.269645
H  1.312433 -4.667255 0.653972
H  1.330998 4.722647 0.53154
H  -5.046728 -0.770314 -1.448505
H  -5.062481 0.99138 -1.19973
H  3.512744 -4.54614 -0.570129
H  3.534403 4.559955 -0.682449
H  -4.255217 0.671345 1.181795
H  -4.246625 -1.102775 0.936065
H  -6.801626 0.712298 0.632778
H  -6.788645 -1.044614 0.377043
H  -7.61726 1.058282 -1.754738
H  -7.610215 -0.709364 -2.009101
H  -8.738144 0.0185 -0.829527
