program: Gaussian 09
title: 000232984
version: EM64L-G09RevD.01
frameworkgroup: C1[X(C8H5Cl2NO5)]
method: RPBEPBE
basis: SDD
operation: Freq
keyword: #p
keyword: freq=noraman
keyword: PBEPBE/SDD
title: #p freq=noraman PBEPBE/SDD
converged: NO YES NO NO
title: Mulliken charges:
elementType: Cl Cl O O O O O N C C C C C C C C H H H H H
charge: 0.019342 0.019200 -0.235927 -0.418249 -0.191459 -0.191464 -0.184749 0.020928 0.580230 0.443220 -0.235416 -0.235272 -0.396778 -0.396786 -0.335015 0.188392 0.316137 0.316131 0.262402 0.262357 0.392774
chargesum: 0.00000
title: Mulliken charges with hydrogens summed into heavy atoms:
elementType: Cl Cl O O O O O N C C C C C C C C
charge: 0.019342 0.019200 -0.235927 -0.025474 -0.191459 -0.191464 -0.184749 0.020928 0.580230 0.443220 -0.235416 -0.235272 -0.080641 -0.080655 0.189744 0.188392
polarizability: 1.98208036e+02 2.89481953e-02 1.47691508e+02 6.34592609e+00 -5.22522708e-02 6.81295390e+01
1716.lowfreq: -23.5187 -4.1943 -0.0018 0.0009 0.0025 1.9224 5.0014 21.7135 37.0807
frequency: -21.3592 21.5824 37.0759 47.2370 58.2908 113.4680 138.0117 157.2419 158.1016 203.9079 207.5097 251.8333 305.5999 341.9382 348.5700 402.0851 428.4740 492.0369 504.9771 508.9501 543.7244 569.3032 575.5017 622.5014 673.4738 703.5979 742.8843 759.4415 775.7399 866.0108 870.9029 908.4027 921.8219 977.9869 990.7384 1042.9179 1056.3931 1113.5179 1174.3828 1197.0797 1209.0107 1234.8104 1261.4932 1355.2694 1370.6389 1378.1020 1401.9766 1429.0095 1447.4034 1571.3401 1579.8711 1706.4655 2989.6079 3051.6723 3191.2906 3192.4598 3527.8904
redmass: 5.7906 9.6737 13.1259 3.3002 13.8287 12.9582 8.5574 17.4493 15.4346 13.5677 4.9975 12.3422 9.5984 23.6437 13.3656 10.6195 7.0764 2.3205 4.4431 5.0304 4.6168 4.9830 5.7293 1.4526 12.3960 6.7175 6.5730 11.3561 8.9177 9.6673 4.4297 1.3595 1.5008 7.7274 1.9104 2.5132 2.3242 4.0922 1.4418 1.0748 12.1521 3.4556 1.8161 5.6656 1.7690 10.5499 6.9015 2.5727 1.1995 9.9687 7.7424 9.5052 1.0557 1.1055 1.0928 1.0937 1.0644
irintensity: 3.7710 1.3380 0.8512 2.0721 0.1549 1.5672 4.0386 2.0932 0.2620 0.4370 0.0065 4.7095 1.2559 0.1288 1.6880 2.5597 26.4326 35.1500 0.4500 0.0234 1.8059 31.4646 0.1036 132.8185 45.0544 15.0005 11.7624 94.9782 6.7118 6.0503 3.5253 0.0022 43.0404 268.8025 0.1881 191.6024 40.8314 21.7323 0.0292 1.3808 321.3928 259.0223 0.9774 0.9027 2.2598 14.4493 197.1611 144.9369 13.8014 25.9227 14.4419 224.9605 29.9989 5.2807 11.7861 12.9877 42.2571
temp: 298.150 k
press: 1.00000 atm
elementType: 17 17 8 8 8 8 8 7 6 6 6 6 6 6 6 6 1 1 1 1 1
symmnumber: 1
zpe: 327247.6 jmol-1
zpe.correction: 0.124642 hartree
zpe.thermalcorrener: 0.139239 hartree
zpe.thermalcorrenthalpy: 0.140183 hartree
zpe.thermalcorrgfe: 0.079888 hartree
zpe.sumelectzpe: -1657.567063 hartree
zpe.sumelectthermal: -1657.552466 hartree
zpe.sumelectthermalent: -1657.551522 hartree
zpe.sumelectthermalfe: -1657.611817 hartree
dipole: -3.5137 -0.0099 2.6761
dipole: 4.4167
quadrupole: -116.2635 -103.8172 -108.4426
quadrupole: 0.1087 -12.4173 0.0696
quadrupole: -6.7557 5.6905 1.0652 0.1087 -12.4173 0.0696
hfenergy: -1657.691705 hartree
pointgroup: C01 [X(C8H5Cl2N1O5)]
dipole: 1.3719582 -0.0065556 -1.0663975 debye
dipolederiv: -0.2328918 -0.2610969 -0.0210717 -0.2787388 -0.5554164 -0.0431492 0.0001126 -0.0186181 -0.0217168 -0.2345509 0.2617713 -0.0230389 0.2794915 -0.5535976 0.0467333 -0.0019176 0.0222811 -0.022235 -1.6401046 -0.0000945 0.2124436 0.0011066 -0.2974205 0.0001025 0.171426 0.0005476 -0.279828 -0.913397 0.0083028 0.5471998 0.0099247 -0.4173599 -0.0078306 0.5520678 -0.006984 -0.8579829 -0.7585749 0.1956449 -0.0423165 0.2216243 -0.6447171 0.0165154 -0.0554205 0.0214394 -0.2192706 -0.7575118 -0.1960431 -0.0410841 -0.2222586 -0.6459112 -0.01404 -0.0540509 -0.018971 -0.2190553 -0.7190847 -0.0019818 -0.2311356 0.0022763 -0.2654462 -0.0074587 0.0372924 -0.0081019 -0.9041419 1.9543181 0.00136 0.1396493 0.0017096 1.0382347 -0.0023252 0.1719657 -0.0023575 0.2002597 1.3734549 0.0010528 -0.060015 0.0023919 -0.1591524 0.0004683 0.2220445 0.0007888 0.0486311 -0.7599017 -0.001164 -0.0558682 -0.0015037 0.1858222 -0.0004964 -0.0751972 -0.0004895 0.0584325 0.0366428 0.4877127 0.0573093 0.6701731 0.845344 0.0723361 0.0224902 0.0342595 -0.0559445 0.039789 -0.4888406 0.0609122 -0.6718275 0.8414629 -0.0783356 0.0258525 -0.0402092 -0.0551816 0.0284823 -0.1825706 0.0081943 0.1172622 -0.2537594 0.0018353 0.0167861 -0.011273 -0.0634869 0.0282867 0.183014 0.0069651 -0.1164476 -0.2534348 -0.0005122 0.0174491 0.0126009 -0.063596 0.4564619 0.0006989 -0.2884744 -0.0018799 0.3435052 -0.0008676 -0.835202 -0.0013666 0.298424 1.5746722 -0.0067437 -0.1600419 -0.011205 0.1949628 0.0181122 -0.2472342 0.0174683 1.505195 0.1385853 0.0333859 -0.0032824 -0.0060905 0.105855 0.0010478 -0.0075635 0.0049781 0.1796607 0.1386384 -0.033311 -0.0030524 0.0061144 0.1057343 -0.0005705 -0.007413 -0.0045602 0.17971 0.0191592 -0.0265735 0.0006814 0.0180876 -0.0033786 -0.095551 0.0975548 -0.0434406 0.019305 0.0182488 0.0263656 0.0004921 -0.0189318 -0.0028954 0.0958414 0.0983733 0.0435319 0.0183229 0.2092775 -0.0008889 -0.104466 -0.0012786 0.3915685 -0.0018553 -0.1494161 -0.0015241 0.2544982 unknown
polarizability: 198.3202299|-0.0278005|147.6913545|5.0658882|-0.1265717|68.0174989 unknown
InChI: InChI=1S/C8H5Cl2NO5/c9-5-1-4(11(14)15)2-6(10)8(5)16-3-7(12)13/h1-2,12H,3H2
charge 0 multiplicity 1
21 atoms
Cl 0.558529 2.780959 0.268905
Cl 0.56549 -2.774051 0.287114
O  1.756521 0.00608 0.525126
O  4.898416 -0.019039 -1.309853
O  -4.489813 1.136753 -0.232833
O  -4.486884 -1.145896 -0.225942
O  4.485241 0.01345 0.987326
N  -3.89089 -0.003622 -0.168818
C  0.387007 0.003269 0.268667
C  -2.411516 -0.001259 -0.019526
C  -0.345689 1.218105 0.183423
C  -0.342559 -1.213982 0.191159
C  -1.741478 1.238135 0.043508
C  -1.738272 -1.238496 0.051237
C  2.624458 0.000369 -0.663659
C  4.066854 -0.000138 -0.179934
H  -2.307331 2.170598 -0.015408
H  -2.301735 -2.172763 -0.001795
H  2.445823 -0.902487 -1.27864
H  2.448967 0.900442 -1.283871
H  5.851962 -0.01783 -1.025089
