program: Gaussian 09
title: 000232983
version: EM64L-G09RevD.01
frameworkgroup: C1[X(C9H8Cl3NO3)]
method: RPBEPBE
basis: SDD
operation: Freq
keyword: #p
keyword: freq=noraman
keyword: PBEPBE/SDD
title: #p freq=noraman PBEPBE/SDD
converged: YES YES NO NO
title: Mulliken charges:
elementType: Cl Cl Cl O O O N C C C C C C C C C H H H H H H H H
charge: 0.052690 0.143177 0.125599 -0.362703 -0.511705 -0.275713 -0.378346 -0.028308 0.099923 0.221148 -0.622604 0.254872 -0.304512 -0.386597 -0.247637 -0.194413 0.319415 0.388881 0.285015 0.221100 0.238884 0.235939 0.344366 0.381530
chargesum: 0.00000
title: Mulliken charges with hydrogens summed into heavy atoms:
elementType: Cl Cl Cl O O O N C C C C C C C C C
charge: 0.052690 0.143177 0.125599 -0.018336 -0.130176 -0.275713 0.010535 0.291107 0.099923 0.221148 -0.622604 0.254872 -0.019497 -0.165497 -0.008753 0.041526
polarizability: 1.99151265e+02 4.82312927e+00 1.47583698e+02 1.86534182e+01 -6.18000468e+00 9.19323457e+01
1716.lowfreq: -4.8860 0.0012 0.0014 0.0018 4.3451 8.5437 27.2969 34.2256 45.6009
frequency: 27.2206 34.1617 45.5800 68.6412 118.1568 135.8324 167.5136 176.0981 197.4903 246.1347 248.3610 254.6290 294.7311 300.5512 331.1818 345.4341 367.6041 376.1311 412.3633 438.6266 498.5837 522.3031 532.3293 540.3025 569.6929 646.3166 675.9653 725.3972 753.8151 754.7987 771.3577 792.3510 803.4951 860.0933 860.1745 956.4026 962.7417 1002.5883 1011.8219 1034.5828 1066.9114 1086.9068 1139.5038 1154.6269 1173.5274 1219.7048 1245.7090 1272.0807 1292.7165 1307.3562 1391.6943 1394.5902 1435.7668 1474.2873 1508.0392 1577.6834 1614.3064 1622.4167 3081.0491 3117.5468 3145.8397 3158.0258 3175.0651 3393.3190 3519.6898 3603.3665
redmass: 6.5237 10.4026 12.3244 11.1754 6.1838 5.8421 15.0872 14.2090 7.5754 5.6548 10.1541 8.3072 12.2104 6.8368 1.2783 1.1687 7.3002 12.4923 5.8231 4.0640 4.7635 4.3446 5.4356 5.7220 5.2850 6.1068 4.0603 8.0243 4.4731 3.0765 1.6945 1.5362 3.6197 3.6646 1.8549 4.2102 1.3537 1.3377 7.5400 2.6125 3.3339 2.6610 2.5000 1.2473 1.0603 3.0052 1.4294 2.0643 1.4488 1.4681 7.6986 1.1150 2.4780 2.2358 2.0464 5.9343 6.0474 5.4849 1.0850 1.0891 1.0885 1.0931 1.1002 1.0810 1.0655 1.0664
irintensity: 0.5399 1.3801 0.3439 2.5281 1.2425 0.2280 3.0042 1.8556 0.0812 4.8056 2.5828 8.0803 4.5244 2.4344 77.2105 183.9380 1.8238 8.0911 21.7122 25.3222 7.7047 35.7543 70.0845 31.7782 69.2827 5.8970 16.4863 96.9019 48.7459 96.8110 68.9949 94.8728 96.4907 23.5684 9.1407 138.9209 2.4514 0.8300 53.8701 10.6498 50.7882 35.5980 116.2981 16.0390 4.8912 23.3636 67.3649 72.9640 40.8549 137.8330 10.7920 9.4920 27.8208 210.8985 346.0377 55.8386 104.1032 100.1318 34.7318 9.9748 8.6637 2.7759 21.4156 130.1478 17.0086 50.7606
temp: 298.150 k
press: 1.00000 atm
elementType: 17 17 17 8 8 8 7 6 6 6 6 6 6 6 6 6 1 1 1 1 1 1 1 1
symmnumber: 1
zpe: 418892.1 jmol-1
zpe.correction: 0.159548 hartree
zpe.thermalcorrener: 0.175557 hartree
zpe.thermalcorrenthalpy: 0.176502 hartree
zpe.thermalcorrgfe: 0.114232 hartree
zpe.sumelectzpe: -2007.177640 hartree
zpe.sumelectthermal: -2007.161630 hartree
zpe.sumelectthermalent: -2007.160686 hartree
zpe.sumelectthermalfe: -2007.222955 hartree
dipole: 4.4009 5.4593 0.1053
dipole: 7.0131
quadrupole: -98.6470 -108.5675 -117.5210
quadrupole: 7.1120 1.9657 -6.0945
quadrupole: 9.5982 -0.3223 -9.2758 7.1120 1.9657 -6.0945
hfenergy: -2007.3371875 hartree
pointgroup: C01 [X(C9H8Cl3N1O3)]
dipole: 2.1476367 0.2289773 1.7170225 debye
dipolederiv: -0.295018 -0.1029937 -0.1160498 -0.0994027 -0.3701322 -0.260607 -0.047262 -0.2702879 -0.6160615 -0.8847324 0.1704495 -0.1173635 0.1267048 -0.1388053 0.0238182 -0.1125453 0.0199072 -0.1619402 -0.1922091 0.0832335 0.0067263 0.0479393 -0.7798665 0.1128953 0.0164004 0.1273149 -0.1514612 -0.7577997 0.0289173 0.2595922 0.2707738 -0.8575598 0.1752719 0.1427653 0.2162601 -0.2205758 -0.5076263 0.1906084 0.4191898 0.1546191 -0.5785477 -0.3179387 0.3420148 -0.2775519 -0.7993162 -0.7924153 0.0229941 -0.2023987 0.1255081 -0.4207061 -0.1695462 0.0160845 -0.1977585 -0.8843013 -1.6237808 0.4590483 0.3992266 0.3410552 -0.634346 -0.1075993 0.4203281 -0.0893081 -0.6404435 1.1816011 -0.2336253 -0.3982841 -0.1948646 0.7071797 -0.257392 0.0443913 -0.3250554 0.0799677 -0.6006558 0.0920906 -0.1406533 0.1728533 -0.0880265 -0.0339309 0.0146544 -0.0797008 -0.2134473 1.7692086 -0.387207 0.0431591 -0.6191588 0.512456 0.3773867 -0.3558307 0.4344725 1.1393701 1.263071 -0.1770364 0.2929319 -0.0572613 1.2351781 0.1605562 0.2477549 0.2474297 0.9131143 0.4018979 -0.2695885 -0.4181886 -0.1704844 0.2889263 0.378924 -0.1887861 0.308519 0.6677389 0.1660972 -0.0257217 0.1175986 -0.136136 -0.0374268 0.0106892 -0.1526455 0.0848107 0.0287081 -0.256796 0.1334188 0.2805793 0.0429941 -0.2142722 -0.0264245 0.0594758 0.0425711 -0.054299 -0.2191574 -0.0660181 -0.1661653 -0.0739222 -0.1243838 0.089547 -0.1928912 0.0958973 -0.0918214 0.0980854 -0.06542 0.0040604 -0.0158525 -0.0617958 0.1099254 0.1098064 0.0794375 0.1447865 0.13171 -0.0056728 0.047659 -0.0895773 0.0572207 0.0559638 -0.1248775 -0.0102145 0.1133729 0.4441093 0.031948 0.059388 0.0516225 0.264516 -0.0655581 0.0931552 -0.064518 0.2501086 0.1578705 -0.0254111 -0.0644083 -0.0112454 0.1402732 -0.0244238 -0.0245344 -0.036178 0.0485285 0.0629189 0.016138 -0.0369189 0.0000875 0.1317552 -0.0953463 -0.0784662 -0.0844025 -0.0773158 0.0160136 0.0690337 0.0598394 0.0761987 0.1097042 -0.0850559 0.0723755 -0.0880982 0.0109331 -0.0930073 0.056484 -0.0395391 0.0548862 0.1350717 -0.0128743 -0.0479672 -0.0108469 0.0977939 0.3725876 -0.0069576 -0.1399576 -0.0303013 0.3410988 -0.0580301 -0.1422547 -0.1200263 0.1208887 0.1580269 0.011288 -0.1500234 0.032964 0.3824889 0.0197496 -0.1111459 -0.0026729 0.2956719 unknown
polarizability: 192.6558572|-30.0260073|109.3590891|3.951873|23.7552722|136.6523627 unknown
InChI: InChI=1S/C9H8Cl3NO3/c10-9(11,12)8(16)13-7(15)5-3-1-2-4-6(5)14/h1-4,8,13-14,16H
charge 0 multiplicity 1
24 atoms
Cl -2.656787 1.183258 2.483538
Cl -4.848727 0.58338 0.469818
Cl -2.887211 -1.582897 1.218342
O  -2.359133 2.103199 -0.544852
O  1.309596 0.491152 1.737233
O  -0.393865 -0.613574 -2.005363
N  -0.758891 0.375772 0.071131
C  -2.13219 0.699009 -0.243849
C  1.485321 -0.512326 -0.479292
C  0.052155 -0.258049 -0.871535
C  -3.087092 0.231818 0.896842
C  2.093594 -0.164117 0.759704
C  2.293799 -1.167208 -1.445691
C  3.451217 -0.459825 1.019234
C  3.646809 -1.467063 -1.201264
C  4.227563 -1.111305 0.038939
H  -2.403664 0.169473 -1.172925
H  -0.345312 0.626733 0.981041
H  1.809988 -1.428588 -2.392523
H  3.899151 -0.182266 1.982243
H  4.244741 -1.972467 -1.965611
H  5.278887 -1.338321 0.24511
H  -2.10447 2.655661 0.241568
H  1.819223 0.655048 2.56706
