program: Gaussian 09
title: 000232978
version: EM64L-G09RevD.01
frameworkgroup: C1[X(C12H15NOS)]
method: RPBEPBE
basis: SDD
operation: Freq
keyword: #p
keyword: freq=noraman
keyword: PBEPBE/SDD
title: #p freq=noraman PBEPBE/SDD
converged: YES YES NO NO
title: Mulliken charges:
elementType: S O N C C C C C C C C C C C C H H H H H H H H H H H H H H H
charge: 0.306311 -0.436179 0.010414 0.165154 0.366963 -0.749454 -0.722921 -0.723759 -0.009438 -0.320777 0.344431 -0.293028 -0.395510 -0.874254 -0.346002 0.216322 0.223760 0.220783 0.215557 0.206230 0.260554 0.206786 0.211808 0.260967 0.282192 0.264271 0.258433 0.239426 0.236886 0.374074
chargesum: 0.00000
title: Mulliken charges with hydrogens summed into heavy atoms:
elementType: S O N C C C C C C C C C C C C
charge: 0.306311 -0.062105 0.010414 0.165154 0.366963 -0.088589 -0.040580 -0.044198 -0.009438 -0.038585 0.344431 -0.293028 -0.131239 -0.139509 -0.346002
polarizability: 1.94803384e+02 7.94620743e+00 1.59510018e+02 -5.13448749e+00 -1.55472968e+00 1.15544251e+02
1716.lowfreq: -8.9105 -6.1026 -4.9667 -0.0032 -0.0030 -0.0026 15.7747 49.5746 77.8883
frequency: 15.5288 49.5512 77.8786 87.6876 152.6056 159.3866 174.9959 199.7840 207.5570 217.9855 248.2372 275.0751 288.8778 313.8981 321.0934 329.7971 333.4004 342.0020 353.3073 374.9921 398.8340 399.9085 452.2028 499.0079 519.9768 552.6476 576.6123 590.0993 623.9718 688.5375 749.2560 782.0431 846.8504 882.0134 899.9640 904.5814 923.1383 932.4421 949.4045 996.3834 1021.7340 1029.9071 1043.6759 1111.4670 1144.0627 1172.3329 1203.9618 1216.7462 1246.8462 1266.2207 1283.8174 1371.9784 1374.3633 1385.2499 1397.7962 1401.3258 1412.2917 1428.2368 1456.7268 1470.8395 1476.2619 1478.7806 1480.4213 1487.9599 1489.1248 1505.0628 1581.6729 1601.7616 2100.4602 2953.3034 2972.0416 2977.9094 2982.0808 3022.1047 3064.7965 3067.8068 3070.2130 3076.5613 3092.7673 3106.9241 3110.8336 3153.2624 3182.5292 3569.7716
redmass: 8.8511 4.1564 4.6999 3.6507 4.7812 2.0607 1.7281 1.5880 1.4084 3.0492 1.1015 2.9679 3.1918 1.0648 1.1943 3.4177 7.1562 3.7583 3.5324 11.1327 2.9100 2.7127 9.0845 4.1852 2.9832 3.8788 3.7403 5.6716 8.5280 6.5288 4.9573 4.1180 4.9983 1.3503 2.9402 1.4696 1.6653 1.6753 1.2125 1.5414 1.4039 1.3809 1.5030 2.0419 1.8192 2.9541 2.9299 2.6653 2.0109 1.6918 2.6108 1.1912 1.2407 3.2834 1.5018 1.3590 3.1436 2.0708 1.0487 1.0567 1.0482 1.0583 1.0458 1.2481 1.0524 1.0610 5.8966 7.3869 12.7515 1.0407 1.0356 1.0363 1.0371 1.0982 1.1004 1.0995 1.1000 1.0983 1.0939 1.0986 1.0979 1.0932 1.0910 1.0652
irintensity: 2.0684 1.2400 2.0530 0.8371 0.2912 1.4187 0.9194 1.1391 0.4020 0.5778 0.0136 0.1524 15.4055 44.8546 45.4325 3.3297 0.5539 3.3421 2.0403 0.4351 2.2528 1.6114 9.6560 1.7358 0.2642 1.7577 6.3358 5.1862 9.4824 10.4237 5.4289 5.6336 7.7154 12.9918 12.6469 6.3908 4.0533 7.6647 0.3230 0.8177 1.8455 0.7006 4.8256 61.9194 44.7773 151.5770 6.4791 5.7080 33.5530 6.6798 31.8638 23.5461 19.4046 9.9230 43.4730 26.8157 13.5215 53.3679 0.1667 4.1496 0.3270 11.3137 16.2624 23.9101 12.0294 21.5000 1.9932 2.8232 23.3457 31.0341 20.9889 40.9047 41.6460 17.9162 2.9399 7.9642 48.1253 97.3859 10.2414 2.0391 21.7364 2.0935 0.1165 40.5441
temp: 298.150 k
press: 1.00000 atm
elementType: 16 8 7 6 6 6 6 6 6 6 6 6 6 6 6 1 1 1 1 1 1 1 1 1 1 1 1 1 1 1
symmnumber: 1
zpe: 626457.5 jmol-1
zpe.correction: 0.238605 hartree
zpe.thermalcorrener: 0.255260 hartree
zpe.thermalcorrenthalpy: 0.256204 hartree
zpe.thermalcorrgfe: 0.194339 hartree
zpe.sumelectzpe: -993.164134 hartree
zpe.sumelectthermal: -993.147479 hartree
zpe.sumelectthermalent: -993.146535 hartree
zpe.sumelectthermalfe: -993.208400 hartree
dipole: 4.1447 3.5449 -1.9139
dipole: 5.7799
quadrupole: -113.6925 -82.4464 -104.7981
quadrupole: -3.8261 10.4232 4.1850
quadrupole: -13.3802 17.8660 -4.4858 -3.8261 10.4232 4.1850
hfenergy: -993.4027388 hartree
pointgroup: C01 [X(C12H15N1O1S1)]
dipole: -1.6662769 1.4204724 0.6139098 debye
polarizability: 195.0886594|-8.1264989|159.5736443|-0.4623916|-0.396118|115.1953488 unknown
InChI: InChI=1S/C12H15NOS/c1-8-5-9(15-7-13)6-10(11(8)14)12(2,3)4/h5-6,14H,1-4H3
charge 0 multiplicity 1
30 atoms
S  3.117004 -0.535574 1.186659
O  -2.300634 1.598491 -0.484071
N  4.404605 -1.197257 -1.386794
C  -2.101812 -1.275437 -0.037401
C  -0.909327 -0.300105 0.118173
C  -1.692378 -2.741262 0.266167
C  -2.633267 -1.224164 -1.502887
C  -3.238075 -0.882442 0.956162
C  -1.035136 1.104968 -0.109516
C  0.377151 -0.761477 0.492244
C  0.054854 2.013521 0.024762
C  1.464133 0.125027 0.623733
C  1.3180 1.505418 0.39887
C  -0.1452 3.496866 -0.235398
C  3.852459 -0.917797 -0.359333
H  -1.335534 -2.867701 1.305431
H  -2.57571 -3.392564 0.138229
H  -0.909478 -3.106105 -0.424433
H  -1.84551 -1.529978 -2.216031
H  -3.484853 -1.921648 -1.612755
H  -2.975859 -0.212272 -1.769776
H  -4.084893 -1.585732 0.847102
H  -2.880655 -0.935936 2.001356
H  -3.60535 0.137526 0.762206
H  0.537291 -1.824881 0.680345
H  2.171747 2.181709 0.505872
H  0.797598 4.047411 -0.087565
H  -0.471842 3.699889 -1.275859
H  -0.888827 3.948626 0.452826
H  -2.269803 2.578877 -0.615718
