program: Gaussian 09
title: 000232976
version: EM64L-G09RevD.01
frameworkgroup: C1[X(C14H8Cl4N2)]
method: RPBEPBE
basis: SDD
operation: Freq
keyword: #p
keyword: freq=noraman
keyword: PBEPBE/SDD
title: #p freq=noraman PBEPBE/SDD
converged: NO NO NO NO
title: Mulliken charges:
elementType: Cl Cl Cl Cl N N C C C C C C C C C C C C C C H H H H H H H H
charge: -0.033882 -0.033883 -0.028585 -0.028586 -0.086319 -0.086319 0.522291 0.522291 -0.274253 -0.274253 -0.337974 -0.337975 -0.209440 -0.209441 -0.217024 -0.217025 -0.091186 -0.091185 -0.347077 -0.347077 0.287287 0.287287 0.284867 0.284868 0.263846 0.263846 0.267451 0.267451
chargesum: 0.00000
title: Mulliken charges with hydrogens summed into heavy atoms:
elementType: Cl Cl Cl Cl N N C C C C C C C C C C C C C C
charge: -0.033882 -0.033883 -0.028585 -0.028586 -0.086319 -0.086319 0.522291 0.522291 -0.274253 -0.274253 -0.050688 -0.050688 0.075427 0.075427 0.046821 0.046820 -0.091186 -0.091185 -0.079626 -0.079625
polarizability: 5.45944258e+02 -1.70889967e+01 2.19671243e+02 4.12578646e-03 -2.92785836e-03 7.22186784e+01
1716.lowfreq: -0.0034 -0.0028 -0.0027 3.0516 4.0288 10.8675 18.2948 25.4642 29.8334
frequency: 18.2948 25.4642 29.8334 60.0623 89.4877 104.9669 126.5951 141.1765 161.8257 165.5762 185.4816 189.6362 207.7277 228.5495 242.4593 326.3247 342.9940 351.2731 370.8616 377.1050 389.6832 420.2778 455.6867 458.3100 472.1534 546.4765 551.8020 560.5527 569.9618 646.2925 653.9565 714.4790 722.3578 732.7797 744.5674 839.2668 840.9698 846.7693 869.7039 870.3417 870.3598 973.2443 978.8413 980.9056 990.7702 995.6600 1023.6921 1026.4811 1080.2691 1080.9010 1133.1706 1136.9488 1218.1934 1223.2338 1265.9453 1266.3139 1301.7170 1344.0580 1353.5618 1355.2957 1392.3694 1396.1140 1451.3750 1457.8228 1494.5748 1547.3462 1555.2466 1586.0055 1591.8857 1595.6265 3073.5545 3076.9294 3157.3940 3157.4194 3179.5571 3179.5838 3182.3070 3182.3292
redmass: 15.9158 10.0183 13.5317 7.5834 11.7085 9.3358 22.4521 3.3181 5.5497 5.5841 19.5326 4.2598 14.1776 11.1115 6.2228 13.2646 8.0039 3.9389 8.6552 13.9050 5.1037 7.1052 3.2368 8.0555 4.3276 5.8778 4.3747 4.1439 8.4442 7.2009 7.3879 3.8530 3.9868 8.3403 8.0706 1.3435 1.3723 4.7815 4.3770 1.3967 1.3972 1.4003 8.0932 1.3582 1.4500 1.4973 3.9402 3.7298 2.5037 2.5469 1.4316 1.3999 1.7638 1.6364 1.5257 1.4592 1.5858 3.3874 2.4419 3.9853 5.5332 4.8430 2.7422 3.2437 5.6544 8.5946 8.0092 7.1438 7.2813 6.8964 1.0886 1.0895 1.0891 1.0891 1.0959 1.0959 1.0945 1.0945
irintensity: 0.1263 0.0007 0.4732 0.0000 0.0000 6.1114 0.0000 0.0000 0.1611 0.0000 1.2976 10.9181 0.0000 1.2299 0.0000 21.7144 0.0000 4.6414 12.3348 0.0000 0.0000 19.0232 33.6534 0.0000 0.0000 0.0000 20.5883 0.0000 29.4166 0.0000 3.4553 0.0157 0.0000 0.0000 75.0767 67.0843 0.0000 59.7068 0.0000 0.0008 38.8201 22.8883 0.0000 0.0000 27.8150 0.0000 119.0430 0.0000 144.2285 0.0000 54.0453 0.0000 16.5043 0.0000 49.6463 0.0000 30.1292 0.0000 0.0000 33.6125 46.5157 0.0000 189.3572 0.0000 0.0000 40.6752 0.0000 62.2275 0.0000 375.4436 20.9655 0.0000 0.2958 0.0034 5.0154 0.0029 2.5782 0.0005
temp: 298.150 k
press: 1.00000 atm
elementType: 17 17 17 17 7 7 6 6 6 6 6 6 6 6 6 6 6 6 6 6 1 1 1 1 1 1 1 1
symmnumber: 1
zpe: 475570.0 jmol-1
zpe.correction: 0.181135 hartree
zpe.thermalcorrener: 0.199701 hartree
zpe.thermalcorrenthalpy: 0.200646 hartree
zpe.thermalcorrgfe: 0.130706 hartree
zpe.sumelectzpe: -2486.601695 hartree
zpe.sumelectthermal: -2486.583128 hartree
zpe.sumelectthermalent: -2486.582184 hartree
zpe.sumelectthermalfe: -2486.652123 hartree
dipole: 0.0000 0.0000 -0.0001
dipole: 0.0001
quadrupole: -147.0549 -136.5381 -146.7328
quadrupole: -1.8676 -0.0001 0.0003
quadrupole: -3.6130 6.9039 -3.2909 -1.8676 -0.0001 0.0003
hfenergy: -2486.7828296 hartree
pointgroup: C01 [X(C14H8Cl4N2)]
dipole: -0.000004 -0.000002 -0.0000241 debye
polarizability: 546.431282|-11.5279633|219.1842191|0.004175|-0.0028572|72.2186784 unknown
InChI: InChI=1S/C14H8Cl4N2/c15-11-3-1-9(13(17)5-11)7-19-20-8-10-2-4-12(16)6-14(10)18/h1-8H
charge 0 multiplicity 1
28 atoms
Cl -3.694718 -2.987339 -0.000058
Cl 3.694189 2.987697 -0.000156
Cl -7.482269 1.035014 -0.000457
Cl 7.48174 -1.034656 -0.000169
N  -0.650837 0.295059 0.000181
N  0.650309 -0.294702 0.000072
C  -3.009343 -0.241005 0.000094
C  3.008814 0.241361 -0.000059
C  -4.061623 -1.199288 -0.000071
C  4.061094 1.199644 -0.000118
C  -3.387281 1.136406 0.000063
C  3.386752 -1.136049 -0.000034
C  -5.419866 -0.831282 -0.000231
C  5.419338 0.831639 -0.000152
C  -4.732866 1.536915 -0.000096
C  4.732338 -1.536558 -0.000064
C  -5.734771 0.540922 -0.000243
C  5.734242 -0.540564 -0.000124
C  -1.596992 -0.627643 0.000274
C  1.596463 0.6280 -0.000021
H  -2.580719 1.87598 0.000183
H  2.580191 -1.875623 0.000005
H  -6.205524 -1.590742 -0.00034
H  6.204995 1.5911 -0.000198
H  -5.005123 2.595744 -0.000116
H  5.004595 -2.595387 -0.000045
H  -1.336944 -1.69774 0.000094
H  1.336416 1.698097 -0.000014
