program: Gaussian 09
title: 000232989
version: EM64L-G09RevD.01
frameworkgroup: C1[X(C19H30O2)]
method: RPBEPBE
basis: SDD
operation: Freq
keyword: #pfreq=noraman
keyword: PBEPBE/SDD
title: #p freq=noraman PBEPBE/SDD
converged: YES YES NO NO
title: Mulliken charges:
elementType: O O C C C C C C C C C C C C C C C C C C C H H H H H H H H H H H H H H H H H H H H H H H H H H H H H H
charge: -0.449191 -0.196163 -0.161276 -0.107991 0.410106 -0.084448 -0.116308 -0.522052 -0.532384 -0.053442 -0.503728 -0.195582 -0.552436 -0.478446 -0.457443 -0.519263 -0.822060 -0.604770 -0.130611 0.155164 -0.735667 0.216262 0.236085 0.210820 0.209536 0.192056 0.224699 0.214395 0.211303 0.232564 0.215362 0.206300 0.200834 0.211777 0.228692 0.206187 0.199133 0.227212 0.198934 0.214247 0.225248 0.257815 0.213200 0.222073 0.225125 0.238044 0.218218 0.337266 0.234364 0.205449 0.224791
chargesum: 0.00000
title: Mulliken charges with hydrogens summed into heavy atoms:
elementType: O O C C C C C C C C C C C C C C C C C C C
charge: -0.111924 -0.196163 0.054986 0.128094 0.410106 0.126371 0.093228 -0.105298 -0.106685 0.179123 -0.082065 0.005252 -0.111966 -0.073126 -0.031297 -0.079769 -0.128972 -0.141601 0.087606 0.155164 -0.071063
polarizability: 2.50405071e+02 -2.09631465e+00 1.91772251e+02 -1.56478764e+00 -4.12698796e-01 1.54945908e+02
1716.lowfreq: -15.6969 -7.9652 -0.0009 -0.0005 0.0001 13.7000 37.2555 43.9710 76.5749
frequency: 37.0792 43.9086 76.5530 101.6247 109.0391 118.1247 133.5160 165.4627 175.6537 204.9293 211.2591 228.5382 229.7066 253.1410 262.3176 266.6584 289.1068 294.6873 327.2906 349.9812 351.7174 362.4405 377.4178 412.1891 426.5330 430.0696 459.3425 481.3906 503.3974 534.9802 545.7382 557.3155 592.5632 609.2840 640.9228 688.0214 714.3507 726.1269 794.6405 812.0360 826.5077 834.5017 852.7709 879.2411 890.9164 904.9026 914.4990 936.7636 945.9315 953.1717 979.6634 984.4851 994.9288 1006.5642 1013.8329 1021.0876 1031.2158 1039.1109 1045.2632 1064.8954 1066.4127 1079.4352 1089.4402 1096.5387 1102.1460 1112.6453 1129.0095 1133.8245 1143.1184 1148.1573 1159.2157 1170.0204 1173.5371 1175.6989 1194.9433 1211.1060 1218.8946 1219.9303 1235.2204 1243.0501 1250.2067 1259.9378 1265.3684 1268.2130 1278.2494 1283.7560 1289.6700 1299.9489 1304.5900 1309.6964 1314.1116 1318.3066 1322.1819 1326.7534 1334.0592 1337.0062 1340.8839 1343.5901 1350.8564 1356.6056 1369.2169 1380.3349 1391.3381 1396.5443 1442.4787 1459.0345 1462.3467 1463.4561 1465.3345 1467.2801 1468.6894 1470.9062 1474.7449 1475.2291 1489.3288 1494.8701 1628.7221 2902.6151 2907.5493 2918.2858 2927.1486 2936.6922 2940.3782 2946.2632 2955.8706 2956.9697 2958.4717 2963.9790 2968.3485 2969.9126 2988.1517 2991.6232 2993.7381 3005.5951 3018.5161 3026.6843 3028.0782 3034.0557 3045.8152 3045.8521 3060.9193 3069.0878 3081.2840 3082.4647 3093.4929 3094.3432 3572.7638
redmass: 4.7177 3.7432 4.9835 3.0582 4.1271 2.1313 1.9618 1.1160 1.5706 2.5266 2.8906 2.0124 2.7585 1.2302 2.4084 2.7910 2.6100 2.9585 2.6473 3.4373 2.9060 2.7125 2.3676 3.8201 3.3814 2.9755 2.6306 2.6187 3.3852 3.1275 2.6891 3.1235 2.5344 2.8251 3.4067 3.2927 2.2253 2.5384 2.2102 2.3042 1.9397 1.5790 1.9220 1.6927 1.7667 1.7685 1.9483 1.9271 2.0807 1.9643 2.4801 2.3475 1.8106 1.8645 2.1703 1.8691 3.3724 1.9915 1.9993 1.7449 2.1943 1.9191 2.6716 2.1991 1.5081 1.6558 2.4358 2.1062 2.0253 2.2193 1.6368 1.5954 1.4815 1.7256 1.8759 1.3990 1.7204 1.3441 1.3242 1.4039 1.4054 1.3449 1.2967 1.4257 1.3142 1.3711 1.3345 1.3929 1.2923 1.3092 1.4651 1.4294 1.3908 1.4914 1.3859 1.4822 1.7571 1.5547 1.4504 1.6597 1.5750 1.3214 1.2106 1.3311 1.0935 1.0744 1.0648 1.0831 1.0798 1.0830 1.0708 1.0705 1.0811 1.0752 1.0800 1.0634 9.4491 1.0808 1.0784 1.0820 1.0843 1.0791 1.0817 1.0758 1.0655 1.0648 1.0678 1.0642 1.0653 1.0636 1.0362 1.0587 1.0376 1.0625 1.0963 1.1007 1.0950 1.1011 1.0977 1.1014 1.0970 1.1040 1.0985 1.0999 1.0990 1.0990 1.0662
irintensity: 1.2549 1.9612 1.7751 0.4848 0.5204 0.7217 0.1613 0.1516 0.7667 8.0493 0.1287 10.9176 1.6863 101.8264 13.4839 5.7049 0.7451 8.1086 0.9560 2.8819 1.7915 3.8185 2.2525 0.3686 0.9891 0.4935 0.3753 0.6215 4.2280 0.1997 0.6608 2.7335 5.5838 1.5687 0.2411 3.7141 3.5295 4.8695 1.2620 0.8465 3.8359 5.6468 3.3834 6.2843 5.1001 3.6972 2.5363 2.7917 8.6215 5.5102 3.7348 80.1171 12.4244 6.8802 2.9900 16.7047 11.3025 5.7037 8.1697 9.3940 8.7904 3.1929 7.2356 5.5346 1.7925 3.8122 5.6684 0.9381 4.6085 2.3029 11.8894 12.7019 1.6326 8.6960 48.5170 3.2420 1.9229 5.0937 0.2957 1.6610 6.2860 4.5541 4.0322 2.9653 2.4094 2.4274 2.7111 2.8538 2.7019 9.2837 1.9062 4.1680 3.7194 2.2133 1.0510 0.8001 5.1119 0.4700 1.2738 1.3750 1.3864 9.4209 20.6116 16.1534 9.1209 4.1714 3.0925 12.9456 10.9420 10.4958 4.2331 13.6190 6.6571 3.5305 10.1389 7.0738 189.2137 2.8027 1.0428 8.9121 48.5474 11.1927 4.8170 11.3562 37.5251 5.1312 65.9449 0.8872 54.0067 84.5943 31.2012 29.1021 29.4444 44.4006 52.1704 41.5984 40.0448 83.8734 14.2407 18.1308 25.7375 73.3110 32.7070 31.8119 28.1215 17.9738 3.3372
temp: 298.150 k
press: 1.00000 atm
elementType: 8 8 6 6 6 6 6 6 6 6 6 6 6 6 6 6 6 6 6 6 6 1 1 1 1 1 1 1 1 1 1 1 1 1 1 1 1 1 1 1 1 1 1 1 1 1 1 1 1 1 1
symmnumber: 1
zpe: 1187655.2 jmol-1
zpe.correction: 0.452354 hartree
zpe.thermalcorrener: 0.472639 hartree
zpe.thermalcorrenthalpy: 0.473583 hartree
zpe.thermalcorrgfe: 0.405183 hartree
zpe.sumelectzpe: -890.826045 hartree
zpe.sumelectthermal: -890.805760 hartree
zpe.sumelectthermalent: -890.804816 hartree
zpe.sumelectthermalfe: -890.873216 hartree
dipole: -3.8655 0.6236 0.1516
dipole: 3.9184
quadrupole: -151.9648 -129.9345 -126.4685
quadrupole: -8.5949 14.6993 1.7602
quadrupole: -15.8422 6.1881 9.6541 -8.5949 14.6993 1.7602
hfenergy: -891.2783991 hartree
pointgroup: C01 [X(C19H30O2)]
dipole: 1.5183402 0.2575549 -0.069984 debye
polarizability: 250.3449618|2.572013|191.8144039|-2.1342633|0.1609519|154.963865 unknown
InChI: InChI=1S/C19H30O2/c1-11-9-15-12(10-17(11)20)3-4-14-13(15)7-8-19(2)16(14)5-6-18(19)21/h11-16,18,21H,3-10H2,1-2H3
charge 0 multiplicity 1
51 atoms
O  5.259827 -1.470721 0.018898
O  -5.546177 0.394939 0.610607
C  2.259633 0.691546 0.366324
C  0.835391 0.880958 -0.186328
C  2.913895 -0.648366 -0.098709
C  -0.060964 -0.304704 0.306991
C  -1.511155 -0.16681 -0.250828
C  2.055975 -1.816994 0.436361
C  0.576315 -1.687992 -0.01566
C  -2.119931 1.213955 0.134876
C  0.215586 2.238837 0.220089
C  4.30754 -0.492036 0.563095
C  3.348141 1.764793 0.085556
C  -1.221487 2.38569 -0.32045
C  4.70146 0.999207 0.299293
C  -2.450677 -1.303881 0.22422
C  3.085442 -0.755926 -1.637294
C  -3.561603 1.373245 -0.426444
C  -3.906586 -1.178435 -0.32574
C  -4.456104 0.215482 0.002858
C  -4.82213 -2.309811 0.171784
H  2.156541 0.619292 1.475059
H  0.874072 0.850207 -1.297635
H  -0.122866 -0.21534 1.41754
H  -1.450698 -0.21117 -1.363605
H  2.095927 -1.814098 1.546535
H  2.468302 -2.788484 0.102145
H  0.4990 -1.876032 -1.106241
H  -0.005601 -2.489037 0.477526
H  -2.182855 1.246845 1.245843
H  0.846636 3.068219 -0.154214
H  0.206213 2.319155 1.328208
H  4.196589 -0.658989 1.659091
H  3.249915 2.635476 0.757754
H  3.266954 2.144151 -0.950848
H  -1.662905 3.346106 0.012594
H  -1.197327 2.412768 -1.430694
H  5.330904 1.042237 -0.608981
H  5.290429 1.422606 1.133584
H  -2.48498 -1.312212 1.334328
H  -2.060998 -2.288798 -0.090918
H  3.703326 -1.639136 -1.871533
H  2.116292 -0.861299 -2.153657
H  3.596439 0.12618 -2.06232
H  -3.506308 1.394244 -1.53552
H  -4.013989 2.322605 -0.088289
H  -3.829902 -1.224436 -1.435715
H  6.128324 -1.366894 0.481765
H  -5.840102 -2.210303 -0.242167
H  -4.415609 -3.295531 -0.119894
H  -4.915512 -2.280611 1.272059
