program: Gaussian 09
title: 000232975
version: EM64L-G09RevD.01
frameworkgroup: C1[X(C15H10ClN)]
method: RPBEPBE
basis: SDD
operation: Freq
keyword: #p
keyword: freq=noraman
keyword: PBEPBE/SDD
title: #p freq=noraman PBEPBE/SDD
converged: NO YES NO YES
title: Mulliken charges:
elementType: Cl N C C C C C C C C C C C C C C C H H H H H H H H H H
charge: -0.025578 -0.006856 0.411074 0.460572 -0.393554 -0.103504 0.265032 -0.511001 -0.370154 -0.291183 -0.365455 -0.365475 -0.239069 -0.227024 -0.217760 -0.217761 -0.237185 0.265729 0.257713 0.265359 0.243908 0.243908 0.232984 0.235380 0.229396 0.229395 0.231108
chargesum: 0.00000
title: Mulliken charges with hydrogens summed into heavy atoms:
elementType: Cl N C C C C C C C C C C C C C C C
charge: -0.025578 -0.006856 0.411074 0.460572 -0.393554 -0.103504 0.265032 -0.245272 -0.112441 -0.025824 -0.121548 -0.121567 -0.006084 0.008357 0.011636 0.011635 -0.006077
polarizability: 2.79551406e+02 2.27255684e-01 1.49510432e+02 1.96175205e-03 8.12193893e-03 1.08485883e+02
1716.lowfreq: -39.4391 -5.1594 -0.0031 -0.0031 -0.0025 4.3176 11.7093 45.1125 63.6407
frequency: -39.4237 45.0466 63.6399 108.6030 163.5095 195.7069 215.2936 241.1003 255.9686 371.1031 379.3234 398.2855 427.8341 436.3137 527.1916 534.0504 544.8838 569.7865 571.8255 612.9356 646.1663 677.0636 698.9724 704.9782 765.7843 778.1303 794.1638 798.0152 852.0767 865.4880 887.3566 921.7621 926.7436 953.7281 973.2850 975.1670 987.9293 996.4527 999.5718 1020.3658 1026.7260 1078.3322 1090.1503 1125.4802 1166.1698 1173.3369 1187.9952 1207.6196 1244.5189 1292.4392 1311.0429 1316.8982 1354.9232 1366.2024 1369.8354 1407.8204 1428.6168 1448.3322 1469.6594 1486.3757 1547.3391 1583.1522 1584.6085 1613.2944 1620.6284 3125.2508 3127.6092 3131.2960 3135.6235 3142.5026 3149.9847 3152.0437 3165.0530 3166.4347 3174.8125
redmass: 4.0954 5.6822 6.1090 5.2319 5.1111 9.7835 4.6598 4.9583 7.1134 5.2159 10.1117 2.8246 3.2635 4.6128 7.4689 3.8980 5.4756 4.8584 4.6543 6.2397 6.8190 4.1490 4.7705 1.9669 1.9343 1.3237 6.4220 3.3776 1.2447 5.8793 1.6728 1.4361 1.4456 7.0483 1.3611 1.3866 6.2412 1.3154 1.3264 2.3726 2.2214 1.6038 3.1511 1.8286 1.1814 1.0529 1.1146 2.3904 2.0361 1.9654 1.3642 3.3590 5.2350 2.1941 6.9631 3.6600 2.2003 2.4308 3.2462 2.7351 6.9051 7.8757 6.0246 6.3622 6.6220 1.0846 1.0915 1.0879 1.0859 1.0926 1.0896 1.0970 1.0954 1.1018 1.1000
irintensity: 0.0646 0.8761 0.8221 0.3442 1.1449 0.8129 0.5809 0.2203 0.1936 0.0004 1.4967 0.0011 7.8000 0.2386 0.3772 0.4904 10.6903 20.3714 1.6069 0.4518 17.8121 1.3253 36.3657 35.7179 30.9943 91.0908 17.6110 0.6373 0.0322 7.7342 0.0364 0.1148 10.6273 15.6871 3.2598 0.0619 2.6457 0.0465 0.0157 1.1764 19.0784 8.3848 5.4929 0.1251 2.1995 0.0158 1.9199 3.4373 4.4327 6.7364 0.4686 27.0078 73.6697 1.6804 0.0009 7.6920 8.2575 10.0030 42.6347 7.2846 18.8271 6.0973 1.4470 9.6153 3.4656 1.9291 11.5521 0.2148 3.7393 17.4405 8.2078 34.4215 10.4481 24.5759 23.4831
temp: 298.150 k
press: 1.00000 atm
elementType: 17 7 6 6 6 6 6 6 6 6 6 6 6 6 6 6 6 1 1 1 1 1 1 1 1 1 1
symmnumber: 1
zpe: 531487.1 jmol-1
zpe.correction: 0.202433 hartree
zpe.thermalcorrener: 0.214650 hartree
zpe.thermalcorrenthalpy: 0.215594 hartree
zpe.thermalcorrgfe: 0.163115 hartree
zpe.sumelectzpe: -1091.268278 hartree
zpe.sumelectthermal: -1091.256061 hartree
zpe.sumelectthermalent: -1091.255117 hartree
zpe.sumelectthermalfe: -1091.307597 hartree
dipole: -0.1013 0.8331 0.0000
dipole: 0.8392
quadrupole: -82.8531 -109.9865 -102.1433
quadrupole: 4.6942 -0.0001 0.0040
quadrupole: 15.4746 -11.6589 -3.8157 4.6942 -0.0001 0.0040
hfenergy: -1091.4707112 hartree
pointgroup: C01[X(C15H10Cl1N1)]
dipole: 0.0400447 -0.3277403 0.0003064 debye
polarizability: 279.5510796|0.3065989|149.5107061|-0.009431|-0.0469263|108.4859353 unknown
InChI: InChI=1S/C15H10ClN/c16-15-12-8-4-5-9-14(12)17-10-13(15)11-6-2-1-3-7-11/h1-10H
charge 0 multiplicity 1
27 atoms
Cl 0.190225 -2.457347 0.001966
N  -1.363909 1.944657 -0.001604
C  0.498474 0.313946 -0.000324
C  -1.837809 -0.506277 0.000458
C  -0.421616 -0.738063 0.000586
C  -2.262421 0.884277 -0.000669
C  1.985675 0.142751 -0.000228
C  -0.054988 1.647411 -0.00142
C  -2.831591 -1.535726 0.001356
C  -3.660821 1.185658 -0.000831
C  2.701382 0.083071 1.223099
C  2.701397 0.081878 -1.223486
C  -4.18989 -1.207021 0.001168
C  -4.609507 0.160567 0.000073
C  4.108936 -0.042161 1.222459
C  4.108952 -0.043359 -1.222708
C  4.816711 -0.105661 -0.00009
H  0.642026 2.494105 -0.002161
H  -2.511718 -2.582059 0.002197
H  -3.944626 2.242448 -0.001685
H  2.154488 0.129836 2.171618
H  2.154511 0.127705 -2.172055
H  -4.941583 -2.003774 0.001866
H  -5.678159 0.400553 -0.000055
H  4.650479 -0.089973 2.173792
H  4.650505 -0.092114 -2.173988
H  5.908176 -0.202526 -0.000035
