program: Gaussian 09
title: 000232973
version: EM64L-G09RevD.01
frameworkgroup: C1[X(C16H25ClO)]
method: RPBEPBE
basis: SDD
operation: Freq
keyword: #p
keyword: freq=noraman
keyword: PBEPBE/SDD
title: #p freq=noraman PBEPBE/SDD
converged: YES YES NO NO
title: Mulliken charges:
elementType: Cl O C C C C C C C C C C C C C C C C H H H H H H H H H H H H H H H H H H H H H H H H H
charge: -0.083388 -0.417331 -0.543658 -0.382043 -0.585629 -0.375041 0.426418 0.546039 -0.337680 -0.334831 -0.620767 -0.360498 -0.358636 0.212230 -0.453963 -0.299584 -0.695564 -0.694356 0.226819 0.202684 0.197568 0.228270 0.206783 0.206885 0.206631 0.206766 0.183747 0.192107 0.187352 0.188078 0.246852 0.198302 0.194924 0.196581 0.197301 0.260758 0.210892 0.215329 0.208871 0.209854 0.216786 0.210102 0.358039
chargesum: 0.00000
title: Mulliken charges with hydrogens summed into heavy atoms:
elementType: Cl O C C C C C C C C C C C C C C C C
charge: -0.083388 -0.059292 -0.114155 0.043796 -0.171961 0.038356 0.426418 0.546039 0.038174 0.040600 -0.373915 0.032728 0.035245 0.212230 -0.193205 -0.299584 -0.060472 -0.057615
polarizability: 2.35163495e+02 -2.05210184e+00 2.01143302e+02 3.41610072e+00 -2.01032831e+01 1.38339788e+02
1716.lowfreq: -30.3797 -17.1366 -7.3161 -5.0841 0.0019 0.0019 0.0022 10.3304 19.6321
frequency: -28.4578 -12.9957 18.8164 38.0231 44.7450 55.6399 82.5151 87.6739 111.9876 119.7576 123.3396 139.4287 164.6978 194.0528 220.5465 229.1172 230.4730 231.8992 261.0226 303.8456 315.9270 330.3456 362.9806 385.3208 418.8001 432.1562 443.8644 496.8787 527.1511 533.4267 617.5026 637.5852 723.8789 726.2259 732.2187 747.0032 754.0282 765.3477 814.2172 835.2472 841.5473 865.8437 887.7735 893.9398 910.9945 951.1716 953.6294 967.1203 999.2378 1000.8740 1044.1864 1046.5754 1065.6547 1076.4156 1076.8157 1091.9711 1108.7526 1110.4567 1114.8584 1185.8323 1196.8924 1197.7872 1220.1490 1237.0699 1239.8909 1249.0769 1255.3443 1260.4433 1283.4540 1285.3909 1287.6414 1289.7747 1297.7768 1300.6163 1314.4474 1334.7167 1336.5688 1349.0244 1350.5240 1385.8768 1388.8383 1389.2276 1420.6854 1457.4685 1463.0921 1463.7096 1465.2837 1469.3723 1473.2873 1475.9758 1477.0656 1478.2352 1479.9126 1482.4621 1486.5259 1488.3090 1580.2943 1616.5578 2951.3321 2952.0178 2965.1760 2965.9977 2970.0943 2971.0182 2972.1150 2974.6398 2979.0630 2986.8749 2991.3362 2993.6797 3011.6818 3018.5414 3026.6619 3034.1562 3047.3936 3058.0051 3068.1290 3068.7940 3070.3633 3071.5098 3118.2456 3153.6771 3497.3031
redmass: 1.7495 2.9121 3.0939 4.5658 2.0406 4.6754 2.5427 2.4539 2.9380 2.5413 1.8810 3.5748 3.9169 5.5595 4.6172 1.1211 1.1040 4.5251 2.4648 4.2019 4.5434 3.1783 3.6977 5.7296 3.2474 3.5032 1.1153 4.1942 4.4488 4.1218 5.4579 3.9375 1.0847 1.0673 3.6424 1.5292 1.1425 2.3940 4.5020 1.2875 1.2934 1.4963 1.9957 1.7704 1.5415 1.3558 1.4377 2.1900 3.7363 3.9988 3.1422 3.0812 1.7634 2.3592 2.3545 1.3758 2.0545 2.3086 1.7801 1.4464 1.5793 1.5739 1.8507 1.3030 1.2997 1.5334 1.3710 1.8016 1.1469 1.0549 1.1223 1.1404 1.3514 1.3820 1.5944 1.4109 1.4693 1.6141 1.6305 1.2155 1.2244 4.7119 3.6993 1.2333 1.0723 1.0701 1.0784 1.1146 1.0778 1.0500 1.0429 1.7977 1.3128 1.0835 1.0860 1.0921 6.6383 7.3872 1.0588 1.0587 1.0590 1.0588 1.0572 1.0365 1.0381 1.0609 1.0592 1.0625 1.0982 1.0945 1.1009 1.1006 1.1036 1.1019 1.1047 1.1045 1.1009 1.1008 1.0993 1.0993 1.0913 1.0927 1.0647
irintensity: 0.0441 0.0238 0.0357 0.0330 0.0436 0.0559 0.1152 0.0699 0.0260 0.0910 0.0040 0.2806 0.0519 0.2992 1.4378 0.0285 0.0012 1.3317 1.4056 4.0894 2.2888 2.0452 0.7717 5.7883 1.9498 1.8198 121.8833 0.7599 12.7621 7.3253 8.5634 6.0797 7.3496 8.7732 12.3570 4.4766 0.2157 19.9782 29.3371 14.0615 3.4689 22.2716 2.0777 12.3017 4.4402 0.7725 0.3341 0.6232 1.1193 0.8189 2.7248 2.3241 6.7768 0.5161 0.2007 1.4650 5.4159 19.1999 93.0455 64.4185 0.1189 3.2246 11.6303 19.0377 4.2836 37.8567 9.8633 29.0975 0.7238 0.6431 1.1490 1.0141 0.8077 7.2516 12.6009 0.5368 4.4169 0.6282 0.9948 10.8942 8.7165 11.9578 22.4138 11.6968 0.2999 0.0051 0.6549 3.8229 1.1375 7.4211 12.4764 67.6161 18.4299 2.6336 18.9771 25.5379 22.3918 2.1617 13.3233 11.9575 7.3589 34.9594 35.1968 44.4265 33.5351 27.2206 101.6166 57.0566 1.3338 10.9401 1.3458 10.8031 8.4245 12.4731 62.4771 27.9627 93.7492 100.9669 54.0195 54.1013 13.8675 1.9596 57.2476
temp: 298.150 k
press: 1.00000 atm
elementType: 17 8 6 6 6 6 6 6 6 6 6 6 6 6 6 6 6 6 1 1 1 1 1 1 1 1 1 1 1 1 1 1 1 1 1 1 1 1 1 1 1 1 1
symmnumber: 1
zpe: 972551.5 jmol-1
zpe.correction: 0.370425 hartree
zpe.thermalcorrener: 0.390171 hartree
zpe.thermalcorrenthalpy: 0.391115 hartree
zpe.thermalcorrgfe: 0.320108 hartree
zpe.sumelectzpe: -1158.585113 hartree
zpe.sumelectthermal: -1158.565368 hartree
zpe.sumelectthermalent: -1158.564423 hartree
zpe.sumelectthermalfe: -1158.635430 hartree
dipole: 1.0610 -1.1887 0.2144
dipole: 1.6077
quadrupole: -114.6443 -118.6793 -120.0126
quadrupole: -0.7659 1.2755 -2.7024
quadrupole: 3.1344 -0.9006 -2.2338 -0.7659 1.2755 -2.7024
hfenergy: -1158.9555386 hartree
pointgroup: C01 [X(C16H25Cl1O1)]
dipole: 0.4116492 -0.4635389 0.125493 debye
polarizability: 235.0736069|-2.0043065|197.4390932|3.9160462|-25.0589025|142.1338841 unknown
InChI: InChI=1S/C16H25ClO/c1-3-5-7-9-13-11-14(10-8-6-4-2)16(18)15(17)12-13/h11-12,18H,3-10H2,1-2H3
charge 0 multiplicity 1
43 atoms
Cl -0.17216 4.127647 -1.396541
O  -2.470705 2.366684 -0.414406
C  -2.371278 -0.047138 1.076562
C  -2.920852 -0.929802 -0.079959
C  2.739038 0.32002 1.016392
C  3.279262 -0.638147 -0.082306
C  -1.106937 0.69917 0.692074
C  1.374351 0.895994 0.669897
C  -4.221028 -1.668449 0.305691
C  4.654758 -1.245908 0.27009
C  0.17903 0.22955 1.044378
C  -4.759497 -2.5769 -0.823701
C  5.195536 -2.193873 -0.825054
C  -1.196941 1.897807 -0.068947
C  1.267532 2.093309 -0.080992
C  -0.005838 2.566118 -0.431248
C  -6.066233 -3.30448 -0.439624
C  6.564632 -2.810781 -0.465664
H  -3.158578 0.674646 1.364518
H  -2.167952 -0.68883 1.955763
H  -2.146022 -1.665897 -0.376044
H  -3.10613 -0.286412 -0.961667
H  2.681298 -0.236673 1.972691
H  3.47321 1.135943 1.166347
H  3.349948 -0.085964 -1.041411
H  2.542924 -1.450844 -0.246097
H  -4.044857 -2.282217 1.214564
H  -4.997935 -0.923946 0.578143
H  4.578147 -1.800655 1.229022
H  5.387577 -0.429523 0.441697
H  0.248848 -0.6910 1.637965
H  -4.928381 -1.964489 -1.732738
H  -3.983724 -3.323083 -1.091524
H  4.457883 -3.003065 -1.001535
H  5.278657 -1.636178 -1.780159
H  2.162558 2.646073 -0.383586
H  -6.866446 -2.579638 -0.1979
H  -6.429812 -3.947055 -1.262672
H  -5.916321 -3.946084 0.449408
H  6.500431 -3.401998 0.467402
H  6.929661 -3.480847 -1.265652
H  7.326332 -2.023249 -0.310927
H  -2.387787 3.219566 -0.918748
