program: Gaussian 09
title: 000232972
version: EM64L-G09RevD.01
frameworkgroup: C1[X(C20H14N2)]
method: RPBEPBE
basis: SDD
operation: Freq
keyword: #pfreq=noraman
keyword: PBEPBE/SDD
title: #p freq=noraman PBEPBE/SDD
converged: YES YES NO NO
title: Mulliken charges:
elementType: N N C C C C C C C C C C C C C C C C C C C C H H H H H H H H H H H H H H
charge: -0.112803 -0.112107 0.189732 0.437232 0.400503 0.383748 0.019237 -0.481414 0.154384 -0.399620 -0.366267 -0.444211 -0.422672 -0.402644 -0.312754 -0.371695 -0.408662 -0.217918 -0.236920 -0.237683 -0.242975 -0.235186 0.273463 0.239002 0.270932 0.240493 0.238676 0.241890 0.276577 0.251381 0.240756 0.229342 0.228562 0.229003 0.230567 0.230053
chargesum: 0.00000
title: Mulliken charges with hydrogens summed into heavy atoms:
elementType: N N C C C C C C C C C C C C C C C C C C C C
charge: -0.112803 -0.112107 0.189732 0.437232 0.400503 0.383748 0.019237 -0.207951 0.154384 -0.160617 -0.095334 -0.203719 -0.183996 -0.160754 -0.036176 -0.120315 -0.167906 0.011424 -0.008358 -0.008681 -0.012409 -0.005133
polarizability: 5.43851701e+02 -1.85466783e+01 2.78048528e+02 8.50740231e-02 2.54058617e-02 8.50072050e+01
1716.lowfreq: -6.8258 -0.0007 0.0000 0.0007 2.6323 10.9932 15.8207 43.1075 43.9769
frequency: 15.0195 42.9395 43.8710 80.3894 154.8606 157.4945 163.0000 184.1168 197.0323 201.1948 266.4435 327.3702 329.0853 405.9299 414.8769 428.5931 460.8127 470.4652 477.3864 483.2473 509.8597 525.5742 525.6746 561.1764 566.2085 612.8616 637.1961 641.9449 672.0774 709.1290 752.0330 755.1057 762.2311 782.3661 786.6459 790.3407 806.1911 829.0931 835.9601 873.0112 882.4678 893.8308 918.6413 933.8152 940.8479 964.8035 967.4562 975.4838 985.0494 994.3740 996.0740 1003.9253 1013.3561 1021.0087 1030.0558 1078.9535 1111.0064 1138.8832 1145.6754 1153.7587 1166.2968 1172.7924 1180.9378 1200.8956 1235.9252 1238.5997 1255.2267 1270.8339 1273.6933 1339.1676 1355.2755 1373.8147 1400.7249 1409.1076 1418.1259 1422.0374 1437.8411 1440.8925 1444.9309 1452.3935 1513.2432 1514.2104 1570.5980 1571.9020 1585.0633 1597.0228 1629.3003 1630.9924 3122.0492 3123.1610 3125.6190 3127.5678 3130.9361 3136.5149 3144.4760 3147.7372 3150.4805 3156.6439 3163.2785 3164.3230 3168.2216 3176.4218
redmass: 4.5046 5.0168 5.5741 4.9557 6.2424 5.5897 4.8507 3.8680 4.3076 6.4860 5.1066 4.6812 5.1425 3.2019 4.2238 3.2169 8.0813 3.2106 2.5435 6.6283 6.8472 3.9482 5.8343 6.4651 3.3194 6.8547 6.7943 3.1409 2.7046 6.2970 1.3624 4.8098 1.3454 5.6089 2.4114 1.8695 6.1112 1.5999 1.3278 5.2571 1.5970 1.7334 5.2422 1.5537 1.4047 3.7068 1.4203 1.3853 1.3699 1.3590 1.3768 1.3384 3.6930 2.2677 2.5228 1.9957 1.8477 1.5630 1.2442 1.5282 1.1337 1.0779 1.2289 2.1739 1.9195 1.8223 1.8817 1.8451 2.0480 3.9339 2.7144 2.1719 4.1788 5.7169 4.9212 3.8017 3.6043 2.8445 2.3061 2.2706 3.8822 3.9459 7.2143 6.6696 5.9010 5.9889 6.6834 6.7859 1.0859 1.0862 1.0868 1.0890 1.0885 1.0904 1.0950 1.0931 1.0910 1.0968 1.0996 1.0971 1.0961 1.0964
irintensity: 0.0677 0.8928 0.4831 0.0001 0.0021 0.1098 3.8578 0.0552 0.7637 1.6908 1.8302 0.9382 10.3139 1.0811 7.9421 2.3626 21.2887 0.1939 29.2849 7.3255 0.3089 4.7580 8.7062 8.8045 5.2549 3.6868 5.1685 0.1668 0.0003 0.9114 0.5902 2.3647 46.7212 0.8219 21.8205 80.0874 0.6787 31.8723 56.7749 0.0419 28.5961 5.8733 2.6418 12.5503 0.6180 2.5658 11.8569 2.0869 1.7467 0.0873 3.3744 0.4878 7.2015 3.4093 7.2680 8.1194 27.1922 5.3501 3.2448 11.4136 3.0108 3.4469 1.8318 71.5577 3.3193 6.2984 4.6385 12.7120 1.6959 8.0256 4.1350 15.1999 10.5485 5.9461 15.4123 8.4158 5.7160 4.1514 2.7545 5.7014 10.3244 24.9178 3.6021 9.7194 15.8539 3.9437 17.4452 1.4947 3.9708 0.8733 1.0399 0.0493 10.9429 16.4245 27.7362 30.2150 1.7025 40.8149 43.1466 23.7952 18.1518 14.7878
temp: 298.150 k
press: 1.00000 atm
elementType: 7 7 6 6 6 6 6 6 6 6 6 6 6 6 6 6 6 6 6 6 6 6 1 1 1 1 1 1 1 1 1 1 1 1 1 1
symmnumber: 1
zpe: 732877.5 jmol-1
zpe.correction: 0.279138 hartree
zpe.thermalcorrener: 0.295496 hartree
zpe.thermalcorrenthalpy: 0.296440 hartree
zpe.thermalcorrgfe: 0.233560 hartree
zpe.sumelectzpe: -878.546579 hartree
zpe.sumelectthermal: -878.530221 hartree
zpe.sumelectthermalent: -878.529277 hartree
zpe.sumelectthermalfe: -878.592157 hartree
dipole: -0.2190 0.4303 0.0057
dipole: 0.4829
quadrupole: -95.0904 -108.9448 -136.2968
quadrupole: -1.1681 0.0306 0.0052
quadrupole: 18.3536 4.4992 -22.8528 -1.1681 0.0306 0.0052
hfenergy: -878.825717 hartree
pointgroup: C01 [X(C20H14N2)]
dipole: -0.0935657 -0.1653129 -0.0022233 debye
polarizability: 544.8754311|6.6863444|276.9126805|6.7341437|-1.5127369|85.1193222 unknown
InChI: InChI=1S/C20H14N2/c1-2-8-17-14-18(13-12-15(17)6-1)21-22-20-11-5-9-16-7-3-4-10-19(16)20/h1-14H
charge 0 multiplicity 1
36 atoms
N  0.742887 0.345285 0.005627
N  -0.057645 1.382966 -0.013781
C  3.044999 -0.462842 0.046491
C  4.471864 -0.204633 0.062734
C  -3.412764 -0.418074 -0.053532
C  -4.289121 0.741304 -0.071947
C  2.136106 0.665819 0.021636
C  -1.999811 -0.227884 -0.033613
C  -1.453166 1.069434 -0.031787
C  -3.703325 2.052247 -0.069537
C  2.587634 -1.820588 0.055714
C  4.941681 1.14812 0.053846
C  5.383117 -1.313276 0.087377
C  -3.999732 -1.730731 -0.056062
C  2.640265 1.982987 0.013538
C  -2.321457 2.214732 -0.05009
C  -5.707295 0.540556 -0.092119
C  4.039527 2.220027 0.029656
C  3.500397 -2.878483 0.079903
C  4.909366 -2.62573 0.095856
C  -5.385366 -1.893676 -0.075876
C  -6.246844 -0.74863 -0.094099
H  -1.323073 -1.088803 -0.019811
H  -4.362861 2.927663 -0.083421
H  1.509624 -2.00009 0.043356
H  6.022397 1.333702 0.066217
H  6.460571 -1.110014 0.099451
H  -3.337834 -2.604798 -0.042151
H  1.925524 2.811174 -0.005631
H  -1.855994 3.205449 -0.048193
H  -6.366703 1.416605 -0.10607
H  4.41288 3.249834 0.022892
H  3.138748 -3.912779 0.08684
H  5.611516 -3.466418 0.114734
H  -5.822571 -2.898003 -0.077578
H  -7.333041 -0.890651 -0.10957
