program: Gaussian 09
title: 000232970
version: EM64L-G09RevD.01
frameworkgroup: C1[X(C16H15NO2)]
method: RPBEPBE
basis: SDD
operation: Freq
keyword: #p
keyword: freq=noraman
keyword: PBEPBE/SDD
title: #p freq=noraman PBEPBE/SDD
converged: YES YES NO YES
title: Mulliken charges:
elementType: O O N C C C C C C C C C C C C C C C C H H H H H H H H H H H H H H H
charge: -0.313917 -0.274417 -0.470267 -0.698013 0.327218 0.183103 0.272752 0.187064 -0.581174 -0.384739 -0.422507 -0.397868 0.512202 -0.486809 -0.239041 -0.234600 0.256299 -0.213472 -0.673597 0.247478 0.247477 0.310799 0.239456 0.240712 0.235977 0.223155 0.224364 0.224038 0.329806 0.228511 0.228508 0.212951 0.229275 0.229275
chargesum: 0.00000
title: Mulliken charges with hydrogens summed into heavy atoms:
elementType: O O N C C C C C C C C C C C C C C C C
charge: -0.313917 -0.274417 -0.140461 -0.203058 0.327218 0.183103 0.272752 0.187064 -0.270375 -0.145283 -0.181795 -0.161891 0.512202 -0.263654 -0.014677 -0.010562 0.256299 0.243547 -0.002096
polarizability: 3.51871059e+02 3.81020829e+00 1.83282677e+02 -5.92771015e-03 1.15807208e-03 8.57035635e+01
1716.lowfreq: -8.5991 -5.4229 -0.0008 0.0004 0.0011 0.8518 27.4496 42.1815 63.4092
frequency: 27.3648 42.1516 63.4057 65.3490 83.7549 127.5594 144.6856 154.4344 187.7100 225.2587 238.9718 248.7683 290.5154 346.0922 348.4709 361.4560 422.3018 436.2847 445.6532 500.9221 507.9696 546.3724 592.7671 605.6089 638.0524 643.0140 699.4427 702.1921 707.9266 730.8011 741.4239 758.1204 776.2097 801.1626 820.7619 824.9410 851.1880 868.7788 904.9507 939.9169 941.2050 944.6131 973.0706 980.5620 984.2049 996.2809 1025.1673 1043.5556 1097.0967 1110.9505 1131.0075 1131.3462 1139.3639 1145.1315 1167.9474 1174.7167 1187.8339 1202.0294 1230.4617 1249.8232 1276.4430 1297.0018 1310.7538 1356.2976 1377.8430 1388.7530 1400.0168 1426.4889 1443.8502 1458.7122 1459.7351 1463.1594 1476.4360 1489.1269 1496.5123 1513.6452 1590.7474 1596.7961 1621.5476 1631.0206 1660.6982 2983.6584 2996.2412 3008.3119 3027.9023 3066.6490 3093.1755 3107.5154 3115.3343 3120.0675 3127.0861 3140.7527 3144.9295 3160.2281 3175.4368 3542.1575
redmass: 3.7276 2.8245 6.0566 4.4359 3.3127 3.6615 3.8196 4.6973 5.7092 4.2551 2.1328 1.2510 5.7800 6.3623 4.4760 3.7749 2.7056 2.9049 5.7597 4.0031 3.2443 6.0376 2.9488 6.8012 6.4713 1.3317 4.9647 6.8678 2.9832 5.2785 1.6333 5.1533 2.1307 1.0945 4.5506 1.5718 3.7407 1.3658 1.5389 4.2778 1.4013 1.4117 1.8421 3.5992 1.3438 5.7950 2.1264 3.3741 2.0840 2.2227 1.9841 1.1522 1.4584 1.8419 1.1643 1.9561 1.7797 1.8678 1.7548 1.1331 1.8946 1.5176 2.3750 1.4337 4.6379 3.9569 1.2715 1.1547 2.8328 3.6048 2.8726 1.0404 1.0605 1.1298 3.5681 2.0353 6.7446 5.8476 7.2261 6.9369 8.5347 1.0609 1.0357 1.0580 1.0992 1.1070 1.0985 1.1026 1.0879 1.0853 1.0895 1.0947 1.0961 1.1003 1.0931 1.0760
irintensity: 0.4793 0.0402 4.4141 0.6138 1.0427 3.8189 2.2667 4.3041 1.7534 0.5812 10.5576 1.1857 10.4400 3.2750 0.7519 7.9540 14.2136 0.0490 5.5038 0.0634 1.6435 0.4781 6.7021 3.6595 6.3083 36.8555 45.3907 8.1450 2.7014 6.1309 53.8200 0.0565 62.4162 3.9460 0.9928 46.2877 1.7976 0.1005 6.9653 43.8360 4.3628 0.1314 21.3207 68.8398 0.8840 15.0866 10.8329 277.0485 6.0855 27.8890 3.7649 0.0103 4.8527 308.3653 12.0512 289.1350 13.5118 4.6048 12.3839 0.0300 1.3066 32.8055 10.1209 35.2231 28.4682 45.6850 27.5357 16.5111 14.5310 127.9351 34.8899 12.0177 22.3686 56.6015 109.6916 476.0376 2.6067 104.8861 1.0970 67.1334 240.4213 11.7907 25.3440 26.3940 7.0697 9.5480 32.0651 46.4003 23.3206 3.2469 2.9130 23.5688 25.9718 43.5558 3.1171 34.3699
temp: 298.150 k
press: 1.00000 atm
elementType: 8 8 7 6 6 6 6 6 6 6 6 6 6 6 6 6 6 6 6 1 1 1 1 1 1 1 1 1 1 1 1 1 1 1
symmnumber: 1
zpe: 710726.0 jmol-1
zpe.correction: 0.270701 hartree
zpe.thermalcorrener: 0.287120 hartree
zpe.thermalcorrenthalpy: 0.288064 hartree
zpe.thermalcorrgfe: 0.225473 hartree
zpe.sumelectzpe: -822.602463 hartree
zpe.sumelectthermal: -822.586044 hartree
zpe.sumelectthermalent: -822.585100 hartree
zpe.sumelectthermalfe: -822.647691 hartree
dipole: 1.5939 1.4422 0.0003
dipole: 2.1495
quadrupole: -86.8920 -100.9534 -115.8556
quadrupole: 4.2963 0.0017 -0.0005
quadrupole: 14.3417 0.2803 -14.6220 4.2963 0.0017 -0.0005
hfenergy: -822.873164 hartree
pointgroup: C01 [X(C16H15N1O2)]
dipole: 0.6276891 0.5667403 0.0002906 debye
polarizability: 351.8789083|3.6324004|183.2748214|0.0065333|0.0257078|85.7035703 unknown
InChI: InChI=1S/C16H15NO2/c1-2-19-16(18)17-13-7-8-15-12(10-13)9-11-5-3-4-6-14(11)15/h3-8,10,17H,2,9H2,1H3
charge 0 multiplicity 1
34 atoms
O  4.915115 0.257713 0.000647
O  3.385615 -1.537431 0.000004
N  2.709865 0.739958 0.000482
C  -1.788096 -1.71685 -0.000119
C  -0.813298 -0.544512 0.00019
C  -1.536463 0.686693 0.000538
C  -3.149976 -1.030048 0.000088
C  -2.979736 0.38963 0.000476
C  0.589101 -0.57623 0.000163
C  -0.833318 1.911647 0.000861
C  -4.436955 -1.594281 -0.000051
C  -4.104068 1.245349 0.000727
C  1.290003 0.661965 0.000488
C  0.575281 1.893908 0.000836
C  -5.565347 -0.734689 0.0002
C  -5.397486 0.672568 0.000586
C  3.621346 -0.302891 0.000103
C  6.032373 -0.729119 0.000817
C  7.327958 0.076281 0.001298
H  -1.650207 -2.365629 0.887009
H  -1.650228 -2.365139 -0.887609
H  1.148575 -1.514386 -0.000112
H  -1.364562 2.869642 0.00113
H  -4.573849 -2.68201 -0.000349
H  -3.98361 2.334752 0.001022
H  1.131664 2.839913 0.00108
H  -6.574931 -1.160703 0.000095
H  -6.279969 1.322472 0.000776
H  3.127635 1.673017 0.000781
H  5.934173 -1.370095 0.895676
H  5.93467 -1.369829 -0.894287
H  8.193626 -0.610894 0.001425
H  7.394141 0.717804 -0.894003
H  7.393657 0.717526 0.896834
