program: Gaussian 09
title: 000232969
version: EM64L-G09RevD.01
frameworkgroup: C1[X(C16H12N2)]
method: RPBEPBE
basis: SDD
operation: Freq
keyword: #pfreq=noraman
keyword: PBEPBE/SDD
title: #p freq=noraman PBEPBE/SDD
converged: YES YES NO NO
title: Mulliken charges:
elementType: N N C C C C C C C C C C C C C C C C H H H H H H H H H H H H
charge: -0.111864 -0.116751 0.397326 0.384315 -0.483897 -0.400112 0.149576 -0.401782 -0.408832 -0.367953 -0.243151 -0.234882 0.181527 -0.296862 -0.340285 -0.200732 -0.203842 -0.235910 0.282335 0.239087 0.242928 0.240694 0.251121 0.230600 0.229924 0.275339 0.250868 0.228886 0.231375 0.230953
chargesum: 0.00000
title: Mulliken charges with hydrogens summed into heavy atoms:
elementType: N N C C C C C C C C C C C C C C C C
charge: -0.111864 -0.116751 0.397326 0.384315 -0.201562 -0.161025 0.149576 -0.158854 -0.168138 -0.116833 -0.012551 -0.004958 0.181527 -0.021523 -0.089416 0.028154 0.027534 -0.004957
polarizability: 4.58237804e+02 -4.89077336e+00 1.91944318e+02 -1.32721888e-03 2.40446290e-02 6.94195755e+01
1716.lowfreq: -8.6335 -5.2671 -0.0008 -0.0002 0.0004 8.4411 22.6920 43.8038 57.6614
frequency: 22.6787 43.8010 57.6602 96.3863 161.4886 170.7139 192.5703 254.4975 260.0934 329.0517 374.6143 406.1730 410.0026 471.5476 474.0263 499.5018 503.8621 534.7711 546.9572 606.3547 608.9511 635.6880 661.4588 693.2142 751.7510 756.1134 761.5325 781.1491 789.1505 835.6312 852.6318 853.1697 883.1196 918.7478 937.2904 943.5073 964.9834 968.3198 984.6897 985.8086 987.6150 994.3419 1001.9707 1014.3801 1021.2976 1074.6374 1108.3939 1136.0643 1146.2222 1158.3949 1170.2840 1173.1007 1199.7266 1238.1755 1263.1425 1271.5863 1304.9879 1344.9013 1363.9973 1389.0918 1409.5594 1422.4254 1438.0427 1444.3453 1450.9149 1465.4427 1514.4146 1571.8997 1582.3239 1597.2546 1601.9850 1630.2769 3122.0091 3127.7363 3128.1014 3130.7459 3139.5959 3144.4529 3149.4297 3152.9680 3163.3395 3164.8265 3165.9336 3172.3535
redmass: 3.9509 5.1263 5.2308 5.5381 6.3173 5.8158 3.8847 5.5220 5.9016 4.7167 4.4654 2.9112 3.2626 8.1039 2.5031 3.2355 6.9688 6.1920 3.4822 6.9301 6.5155 6.8165 2.7527 1.8070 6.5848 4.8466 1.3207 1.8978 2.3998 1.3213 1.2469 6.4279 1.6186 5.2976 1.5060 1.4518 3.8022 1.4347 1.3725 6.1941 1.3716 1.3600 1.3262 2.0841 2.2658 1.5065 2.0172 1.9278 1.2502 1.3164 1.0606 1.0772 1.9187 1.8876 2.3626 1.7606 1.3986 2.6812 3.7355 8.5378 5.6728 3.7083 3.8197 2.4683 2.1889 2.2572 3.8821 7.2043 6.2110 6.0068 6.2425 6.6971 1.0859 1.0890 1.0852 1.0886 1.0888 1.0951 1.0912 1.0930 1.1001 1.0965 1.0960 1.0997
irintensity: 0.1990 1.0055 1.1145 0.2027 0.1922 0.6975 0.7067 0.5390 0.0823 2.5595 0.4358 0.0086 0.5806 29.4547 17.8212 10.8336 4.4021 9.0070 4.9079 1.1561 0.6118 4.4845 0.1993 52.2290 0.5849 1.3837 82.0380 21.4655 5.4282 45.2386 0.0467 0.0627 28.4911 3.2962 6.2722 13.2614 1.4450 15.3666 1.4954 0.9480 0.0095 0.0084 0.8547 10.6182 2.8784 11.1187 23.9080 16.6106 3.2381 43.5330 0.1662 1.8199 14.9350 0.3615 5.2375 7.5747 0.1243 6.6630 2.2230 5.4410 6.1604 6.7957 1.3656 10.8494 7.9888 4.6956 13.8335 5.6324 1.7461 3.0847 5.8950 18.0519 3.2218 0.1664 2.2336 9.4528 10.5983 29.0204 0.8867 23.9865 47.7759 16.2840 17.6583 34.0829
temp: 298.150 k
press: 1.00000 atm
elementType: 7 7 6 6 6 6 6 6 6 6 6 6 6 6 6 6 6 6 1 1 1 1 1 1 1 1 1 1 1 1
symmnumber: 1
zpe: 611509.2 jmol-1
zpe.correction: 0.232912 hartree
zpe.thermalcorrener: 0.246637 hartree
zpe.thermalcorrenthalpy: 0.247582 hartree
zpe.thermalcorrgfe: 0.190748 hartree
zpe.sumelectzpe: -725.160811 hartree
zpe.sumelectthermal: -725.147085 hartree
zpe.sumelectthermalent: -725.146141 hartree
zpe.sumelectthermalfe: -725.202975 hartree
dipole: 0.2804 -0.2299 0.0011
dipole: 0.3626
quadrupole: -76.2969 -90.2821 -111.9723
quadrupole: 0.9409 -0.0060 0.0005
quadrupole: 16.5535 2.5683 -19.1219 0.9409 -0.0060 0.0005
hfenergy: -725.3937227 hartree
pointgroup: C01 [X(C16H12N2)]
dipole: -0.1105785 0.0447265 0.0782738 debye
polarizability: 457.9020819|7.9865612|104.3411994|-9.7109671|55.0098842|157.3584168 unknown
InChI: InChI=1S/C16H12N2/c1-2-8-15(9-3-1)17-18-16-11-10-13-6-4-5-7-14(13)12-16/h1-12H
charge 0 multiplicity 1
30 atoms
N  0.979529 -0.384238 -0.704603
N  1.620837 0.241395 0.249588
C  -2.590458 0.226045 0.471966
C  -3.299992 -0.46661 -0.590521
C  -1.165226 0.26549 0.452841
C  -2.541487 -1.09488 -1.63506
C  -0.448432 -0.359665 -0.5841
C  -3.350207 0.855253 1.517978
C  -4.73205 -0.500859 -0.562499
C  -1.150506 -1.044075 -1.634225
C  -4.744503 0.804414 1.517408
C  -5.441579 0.120631 0.468387
C  3.048718 0.213822 0.125548
C  3.765019 -0.426225 -0.926735
C  3.755046 0.890711 1.155012
C  5.171089 -0.381228 -0.935527
C  5.164986 0.930799 1.138489
C  5.876356 0.295283 0.093732
H  -0.610261 0.781734 1.243541
H  -3.075437 -1.617491 -2.437093
H  -2.813189 1.37727 2.318773
H  -5.265847 -1.023872 -1.36496
H  -0.554649 -1.516705 -2.421472
H  -5.31448 1.286869 2.318776
H  -6.536605 0.088414 0.480101
H  3.200232 -0.941715 -1.709438
H  3.175849 1.372801 1.949537
H  5.727424 -0.871557 -1.742433
H  5.707195 1.453345 1.933889
H  6.971625 0.324742 0.078102
