program: Gaussian 09
title: 000232966
version: EM64L-G09RevD.01
frameworkgroup: C1[X(C19H14O2)]
method: RPBEPBE
basis: SDD
operation: Freq
keyword: #pfreq=noraman
keyword: PBEPBE/SDD
title: #p freq=noraman PBEPBE/SDD
converged: NO NO NO NO
title: Mulliken charges:
elementType: O O C C C C C C C C C C C C C C C C C C C H H H H H H H H H H H H H H
charge: -0.260909 -0.423697 0.294163 0.501245 0.188823 0.242906 0.534634 0.207181 -0.769027 -0.189598 -0.706340 0.099275 -0.360979 -0.398149 -0.464395 -0.391361 -0.261959 -0.240921 -0.238351 -0.243339 -0.533585 0.231204 0.186241 0.228464 0.279995 0.277321 0.244604 0.227829 0.231316 0.227880 0.225725 0.361817 0.248421 0.221876 0.221693
chargesum: 0.00000
title: Mulliken charges with hydrogens summed into heavy atoms:
elementType: O O C C C C C C C C C C C C C C C C C C C
charge: -0.260909 -0.061880 0.294163 0.501245 0.188823 0.242906 0.534634 0.207181 -0.537823 -0.189598 -0.520100 0.099275 -0.132515 -0.118154 -0.219791 -0.114040 -0.034129 -0.009605 -0.010471 -0.017614 0.158404
polarizability: 4.04201201e+02 -8.97051486e+00 2.48372455e+02 -2.09365119e-02 -2.80408526e-02 8.47477767e+01
1716.lowfreq: -70.7011 -0.0008 -0.0007 -0.0006 0.7975 1.9462 7.4816 64.1902 83.8440
frequency: -70.6437 64.1826 83.7862 89.1146 135.0342 145.8636 160.0946 181.5597 192.5346 231.1790 257.7995 278.0130 297.6168 310.6446 320.3951 378.7184 390.1020 420.0419 449.3048 467.1041 497.1689 515.0940 515.9158 545.1768 581.2163 600.8904 606.2173 629.7179 629.8843 657.3201 719.2474 739.7954 757.1701 763.3363 776.3817 789.6436 809.3086 837.9130 842.4181 866.7768 883.8306 905.1124 945.9626 949.3075 950.4224 967.9097 971.3774 993.1707 996.6099 1018.7642 1040.6880 1061.6915 1081.2028 1112.4733 1123.0272 1153.7288 1163.0364 1166.4080 1179.2649 1182.1435 1215.4972 1242.6891 1253.7690 1263.6563 1287.6902 1320.9320 1361.9920 1372.6029 1398.7230 1416.0064 1419.0514 1428.3848 1440.2069 1449.1915 1461.7965 1466.5566 1471.1350 1480.3421 1506.8738 1555.0738 1572.3126 1592.7235 1614.9514 1621.6876 1634.3757 2955.4400 3044.0398 3115.1855 3117.8003 3128.2063 3128.5764 3133.3585 3143.8632 3150.0998 3153.0367 3165.2877 3175.0179 3178.5683 3612.6585
redmass: 1.5709 4.7625 2.4120 3.3959 3.9647 4.3349 4.7157 3.0011 4.0481 3.1985 1.3248 5.3252 3.9265 6.0538 5.8980 4.3352 4.9242 2.9911 3.8121 6.0533 7.0166 6.6724 3.3059 3.1267 7.4273 6.2024 3.2119 5.3268 3.2770 6.3807 3.4611 5.4251 1.3208 5.8494 1.4456 1.6412 2.6104 4.9144 1.7517 1.4197 5.2989 1.9061 6.8764 4.3353 3.5791 1.4102 1.4341 1.3331 1.3471 2.2024 2.4789 3.7458 4.0198 1.2629 1.8563 1.5002 1.5577 1.2009 1.1430 1.3197 1.7548 2.0455 1.7088 1.9045 2.2104 2.5110 3.0106 3.1828 4.6268 2.7374 2.9092 2.0146 1.6817 4.3141 2.6254 1.0500 1.3413 2.1144 3.6783 6.1360 7.5511 5.9635 6.1556 6.6524 6.9789 1.0333 1.1041 1.0889 1.0863 1.0977 1.0867 1.0903 1.0910 1.0911 1.0963 1.0939 1.0969 1.0966 1.0653
irintensity: 39.2111 5.0409 27.1912 3.4076 6.6616 0.7587 0.1071 11.5650 3.2340 23.0310 0.8143 4.2099 0.2268 4.1203 1.6582 6.0515 2.9120 8.6981 2.0088 4.0249 5.1909 6.4338 1.6183 8.8011 0.7519 14.7503 0.7945 6.0056 1.2174 4.4059 29.6502 5.2864 72.4930 3.9171 44.9984 12.0332 3.8141 4.4699 75.1955 3.3681 0.0855 7.2687 7.1588 70.2971 1.1159 1.5374 7.6743 0.0775 0.2209 14.1495 1.0648 56.9361 94.2866 0.0732 15.8579 29.2901 20.9088 47.9011 23.8236 86.1651 32.4768 115.0222 5.9822 45.6905 12.3934 9.2912 28.9519 4.6755 11.7436 3.1433 75.7806 15.4352 0.5458 6.7505 23.3334 14.5586 27.1160 21.9890 55.4526 11.5443 19.0479 33.6655 10.5842 103.9221 6.3316 59.5487 45.4393 31.9396 0.3549 12.8985 5.6875 15.7215 19.1491 3.8346 37.8020 25.9106 20.4432 14.7138 19.2965
temp: 298.150 k
press: 1.00000 atm
elementType: 8 8 6 6 6 6 6 6 6 6 6 6 6 6 6 6 6 6 6 6 6 1 1 1 1 1 1 1 1 1 1 1 1 1 1
symmnumber: 1
zpe: 714345.1 jmol-1
zpe.correction: 0.272080 hartree
zpe.thermalcorrener: 0.287888 hartree
zpe.thermalcorrenthalpy: 0.288832 hartree
zpe.thermalcorrgfe: 0.229767 hartree
zpe.sumelectzpe: -881.457677 hartree
zpe.sumelectthermal: -881.441868 hartree
zpe.sumelectthermalent: -881.440924 hartree
zpe.sumelectthermalfe: -881.499989 hartree
dipole: 1.7799 1.5967 0.0053
dipole: 2.3911
quadrupole: -111.8957 -95.5703 -129.8518
quadrupole: 9.1401 0.0077 -0.0013
quadrupole: 0.5435 16.8690 -17.4126 9.1401 0.0077 -0.0013
hfenergy: -881.7297564 hartree
pointgroup: C01 [X(C19H14O2)]
dipole: 0.6962104 -0.6300339 -0.057558 debye
polarizability: 404.2269313|8.3353284|247.4807552|-4.4714673|11.3097912|85.6137466 unknown
InChI: InChI=1S/C19H14O2/c1-21-18-11-17-16(14-8-4-5-9-15(14)18)10-12-6-2-3-7-13(12)19(17)20/h2-11,20H,1H3
charge 0 multiplicity 1
35 atoms
O  3.537032 -1.893359 -0.274606
O  -1.661529 -2.716873 -0.248261
C  0.084873 0.639473 -0.040573
C  -0.084967 -0.801414 -0.139165
C  1.456925 1.184164 -0.024059
C  2.588125 0.301844 -0.103773
C  -2.371033 0.923812 0.018078
C  -2.559638 -0.508588 -0.079601
C  -1.054617 1.462604 0.035102
C  -1.400523 -1.338993 -0.15601
C  1.081122 -1.662154 -0.218178
C  2.359933 -1.137533 -0.201693
C  1.717302 2.584646 0.069847
C  3.91454 0.822461 -0.088023
C  -3.535819 1.766139 0.095278
C  -3.890623 -1.050112 -0.096765
C  3.027157 3.089431 0.084572
C  4.136575 2.20415 0.005244
C  -4.995841 -0.203766 -0.020212
C  -4.817182 1.219052 0.076812
C  3.405287 -3.347948 -0.377686
H  -0.952183 2.54939 0.108929
H  0.95354 -2.748401 -0.292063
H  0.88353 3.289567 0.13227
H  4.750994 0.121925 -0.150255
H  -4.009115 -2.134422 -0.170656
H  -3.392728 2.851126 0.168775
H  3.19408 4.169949 0.157361
H  5.158179 2.599575 0.016666
H  -6.010679 -0.616829 -0.033107
H  -5.698414 1.867933 0.135922
H  -0.830906 -3.246731 -0.298808
H  4.43607 -3.728151 -0.420804
H  2.862091 -3.634582 -1.299807
H  2.889444 -3.765986 0.509249
