program: Gaussian 09
title: 000232965
version: EM64L-G09RevD.01
frameworkgroup: C1[X(C16H16O2)]
method: RPBEPBE
basis: SDD
operation: Freq
keyword: #pfreq=noraman
keyword: PBEPBE/SDD
title: #p freq=noraman PBEPBE/SDD
converged: YES YES NO NO
title: Mulliken charges:
elementType: O O C C C C C C C C C C C C C C C C H H H H H H H H H H H H H H H H
charge: -0.274379 -0.272452 0.536455 0.530620 -0.333185 -0.313372 -0.527186 -0.540087 -0.438124 -0.419629 0.331255 0.326485 -0.226782 -0.223805 -0.381288 -0.381502 -0.537182 -0.536572 0.215330 0.219986 0.246722 0.251029 0.227644 0.222968 0.221949 0.220252 0.242480 0.241978 0.220199 0.220200 0.244572 0.244540 0.220449 0.220432
chargesum: 0.00000
title: Mulliken charges with hydrogens summed into heavy atoms:
elementType: O O C C C C C C C C C C C C C C C C
charge: -0.274379 -0.272452 0.536455 0.530620 -0.117854 -0.093386 -0.280464 -0.289058 -0.210480 -0.196662 0.331255 0.326485 -0.004832 -0.003554 -0.138807 -0.139523 0.147789 0.148848
polarizability: 3.85975436e+02 -9.23520436e+00 1.92080226e+02 5.82395676e-02 -6.48774733e-03 8.08373375e+01
1716.lowfreq: -3.0997 -2.6782 -0.0008 0.0006 0.0010 6.3639 17.7669 44.2371 48.5646
frequency: 17.5511 44.2215 48.5604 73.0814 99.3388 109.9550 146.6039 195.7374 204.4990 207.5488 234.0206 237.7042 260.8357 268.1788 284.1210 293.6278 393.0523 438.2847 440.9445 460.2362 491.6556 527.4919 555.0347 557.9159 573.1264 620.1223 640.2639 686.2019 697.5788 719.8098 764.4295 777.5445 785.9605 854.3568 869.1107 878.7372 889.6873 895.9721 914.9441 916.1072 964.1279 966.2226 979.9403 982.2077 987.9346 1013.3368 1020.9985 1093.7373 1096.0439 1110.7016 1112.9229 1144.2529 1151.0968 1164.2103 1167.7197 1186.7352 1194.8575 1238.7439 1255.4705 1284.7358 1298.2395 1321.1887 1331.7147 1392.9524 1397.2994 1427.7341 1433.3161 1440.6822 1450.8158 1465.9168 1467.2708 1473.1511 1475.4625 1476.5140 1485.4819 1578.0216 1581.2403 1611.5355 1618.6561 1649.5898 2957.2788 2957.5494 3044.3539 3044.5483 3092.6888 3102.9236 3123.3369 3123.7911 3125.0302 3128.9197 3145.8150 3146.4501 3153.9155 3158.2063 3168.8884 3169.2899
redmass: 4.5341 3.7147 4.8794 3.3519 3.5481 3.0137 5.0589 1.6672 1.7941 5.4831 2.0976 3.3375 1.7053 1.7806 3.4485 4.1515 4.8466 4.9466 2.8423 3.0137 4.9638 6.1399 5.1944 4.4341 3.9692 4.3514 6.3576 1.8535 1.7369 6.5830 5.5798 1.5039 1.5937 1.4671 1.4708 1.5081 1.6793 4.5769 2.0491 4.5224 1.3139 1.3361 5.9706 6.1093 1.1501 4.1921 3.1289 1.7398 1.6520 1.2604 1.2584 1.6254 1.4328 1.4647 1.4482 1.1935 1.3651 2.3615 1.8809 1.7898 1.6806 1.5794 1.3097 7.7064 7.0205 1.8060 1.2770 1.6314 2.1309 1.0503 1.0501 1.2501 1.2474 1.5367 2.6286 5.6920 5.5358 6.2586 6.5838 5.3584 1.0331 1.0331 1.1038 1.1039 1.0919 1.0859 1.0988 1.0990 1.0867 1.0864 1.0932 1.0914 1.0926 1.0911 1.0968 1.0962
irintensity: 0.0083 5.7356 0.7352 0.0212 8.9799 0.8075 0.2182 0.6482 0.4650 0.0226 0.1095 7.3828 0.4880 0.6906 0.7024 0.0010 0.2029 3.6186 0.0413 9.0837 1.8980 6.7951 14.7668 15.2978 0.0894 0.1280 0.5344 1.0928 72.2629 12.5768 14.9694 1.2616 79.8052 2.8271 1.0913 0.2293 36.5373 2.1939 1.0356 4.7055 3.9835 0.1321 0.9148 0.6479 68.8270 49.8783 101.0345 10.5854 8.4946 0.2407 0.2479 23.5968 29.6116 51.3112 93.5694 0.8672 50.2657 70.3325 148.4289 64.2907 4.7576 1.8784 2.8338 28.4137 1.2363 19.9432 37.4460 8.7936 54.8347 12.8993 13.0885 40.8593 1.9454 40.4588 63.6742 36.5190 104.3677 40.2924 205.0119 2.4447 125.7061 36.9450 42.7114 59.0685 0.0232 43.5262 22.0294 30.5250 10.8500 6.6332 21.4081 11.1910 12.9315 2.4187 22.6024 15.9414
temp: 298.150 k
press: 1.00000 atm
elementType: 8 8 6 6 6 6 6 6 6 6 6 6 6 6 6 6 6 6 1 1 1 1 1 1 1 1 1 1 1 1 1 1 1 1
symmnumber: 1
zpe: 719015.0 jmol-1
zpe.correction: 0.273858 hartree
zpe.thermalcorrener: 0.290675 hartree
zpe.thermalcorrenthalpy: 0.291619 hartree
zpe.thermalcorrgfe: 0.227756 hartree
zpe.sumelectzpe: -768.424198 hartree
zpe.sumelectthermal: -768.407382 hartree
zpe.sumelectthermalent: -768.406438 hartree
zpe.sumelectthermalfe: -768.470301 hartree
dipole: 0.0950 -0.7167 0.0027
dipole: 0.7230
quadrupole: -57.9436 -98.3069 -113.9768
quadrupole: 3.2622 -0.0055 0.0028
quadrupole: 32.1322 -8.2311 -23.9011 3.2622 -0.0055 0.0028
hfenergy: -768.6980568 hartree
pointgroup: C01 [X(C16H16O2)]
dipole: -0.0398903 0.2816087 -0.0028438 debye
polarizability: 386.1207045|-7.5168812|191.9087143|-1.037189|-1.5620735|80.8635805 unknown
InChI: InChI=1S/C16H16O2/c1-17-15-7-3-5-13(11-15)9-10-14-6-4-8-16(12-14)18-2/h3-12H,1-2H3
charge 0 multiplicity 1
34 atoms
O  -4.416334 -2.020241 0.040532
O  4.909432 -1.744529 0.006872
C  -2.026531 0.803107 -0.006456
C  1.872003 0.37384 -0.015337
C  -0.575246 1.054964 -0.015858
C  0.421945 0.115998 -0.006108
C  -2.589523 -0.499923 0.012831
C  2.753763 -0.737391 -0.001278
C  -2.91269 1.922915 -0.017106
C  2.437735 1.686566 -0.037811
C  -3.990001 -0.680683 0.021475
C  4.157036 -0.557866 -0.009105
C  -4.306966 1.734651 -0.00835
C  3.832201 1.855917 -0.045617
C  -4.866114 0.43585 0.011048
C  4.711983 0.74472 -0.031489
C  -5.858134 -2.272949 0.049404
C  6.367937 -1.619168 0.001523
H  -0.297649 2.118452 -0.031962
H  0.143755 -0.947458 0.010501
H  -1.961828 -1.396146 0.021373
H  2.362752 -1.760827 0.016123
H  -2.49621 2.936895 -0.032172
H  1.788723 2.567777 -0.049205
H  -4.974141 2.603894 -0.016629
H  4.255224 2.866883 -0.063064
H  -5.9524 0.308655 0.017525
H  5.793768 0.906173 -0.038028
H  -6.345575 -1.866712 -0.858558
H  -6.338429 -1.844465 0.950925
H  -5.957028 -3.368362 0.063324
H  6.744893 -2.652336 0.01736
H  6.729758 -1.076388 0.896753
H  6.72569 -1.105712 -0.912437
