program: Gaussian 09
title: 000232950
version: EM64L-G09RevD.01
frameworkgroup: C1[X(C16H13Cl2N3O2S)]
method: RPBEPBE
basis: SDD
operation: Freq
keyword: #p
keyword: freq=noraman
keyword: PBEPBE/SDD
title: #p freq=noraman PBEPBE/SDD
converged: YES YES NO NO
title: Mulliken charges:
elementType: Cl Cl S O O N N N C C C C C C C C C C C C C C C C H H H H H H H H H H H H H
charge: -0.024992 -0.022437 0.273996 -0.237716 -0.204801 -0.428986 -0.379811 -0.376860 -0.562615 -0.531593 0.202979 -0.345837 0.568086 0.211508 -0.269157 -0.389138 -0.239343 -0.208025 0.604853 -0.310557 -0.339738 -0.060471 -0.204191 -0.266543 0.306008 0.272213 0.280607 0.334114 0.250386 0.237971 0.322165 0.238255 0.236655 0.322664 0.251977 0.229714 0.258660
chargesum: 0.00000
title: Mulliken charges with hydrogens summed into heavy atoms:
elementType: Cl Cl S O O N N N C C C C C C C C C C C C C C C C
charge: -0.024992 -0.022437 0.273996 -0.237716 -0.204801 -0.094872 -0.057647 -0.054196 -0.256607 0.021226 0.202979 -0.345837 0.568086 0.211508 -0.018771 -0.151167 -0.001088 0.028630 0.604853 -0.310557 -0.087761 -0.060471 0.025523 -0.007883
polarizability: 2.88679507e+02 -1.54175064e+01 2.83976233e+02 3.13448970e+01 1.04643713e+01 1.34383266e+02
1716.lowfreq: -5.8681 -1.5313 -0.0014 0.0015 0.0018 5.2925 9.8780 15.2848 20.8744
frequency: 9.7513 15.2781 20.8265 36.7134 40.6207 54.6630 85.5023 89.5349 94.7556 158.8524 181.1801 191.7084 199.6584 226.3148 236.5260 244.5725 276.3047 289.0905 300.6256 322.3243 344.1856 359.8871 386.1636 412.5924 429.8555 434.4038 447.6526 459.7779 494.0019 499.3491 509.5879 537.3752 542.4848 556.0226 579.1279 637.3581 653.7671 662.7566 671.9558 696.9118 698.7880 709.0667 722.8254 728.9021 733.8106 762.1859 771.2850 850.2952 863.4406 866.5011 869.5426 895.5189 911.0390 943.2532 958.0474 959.9986 981.4120 1008.3213 1029.8452 1052.9055 1069.6496 1087.0739 1106.0432 1132.7489 1152.0655 1174.1049 1178.3293 1194.4812 1214.5667 1230.9317 1250.6746 1261.9105 1265.9499 1313.5251 1329.5401 1349.5848 1362.3225 1370.6664 1405.2311 1417.0664 1439.6911 1446.7289 1457.6664 1458.8772 1473.8613 1490.2576 1572.4904 1587.6456 1599.1843 1605.9873 1621.2717 1647.2612 3000.7982 3015.9739 3099.3466 3126.6308 3141.1225 3146.4573 3154.0366 3169.2965 3173.5568 3183.2925 3497.8562 3504.8469 3512.3973
redmass: 7.1195 7.8218 8.7870 7.7528 8.1298 8.7647 8.4951 11.0897 8.4807 5.3422 6.0371 22.5446 4.6906 5.9615 7.6430 6.2484 5.0978 3.7301 4.6705 4.6519 7.3565 4.6452 6.3970 4.8028 3.8461 5.0624 2.4195 3.5427 4.4110 5.6463 4.0792 3.7658 1.6083 4.0123 4.3014 4.2689 2.6933 3.6799 6.5612 3.1140 3.0670 6.7569 3.6234 2.6203 3.5947 1.3694 1.5435 3.4123 2.2281 1.4964 2.5921 3.2482 5.3721 1.3885 2.6338 1.4323 1.3273 7.1432 3.3427 3.0186 2.6163 1.8039 2.0889 1.6357 1.7048 1.0579 1.3762 1.5028 1.8914 1.7528 1.5044 1.5815 1.9038 1.8828 2.7076 2.2310 4.3170 4.0355 2.2491 3.2585 1.3461 2.0257 1.3239 2.4534 2.6544 1.8210 5.0536 7.3383 6.3141 7.0741 5.1813 7.8695 1.0841 1.0638 1.0979 1.0886 1.0880 1.0870 1.0939 1.0928 1.1007 1.0979 1.0785 1.0773 1.0758
irintensity: 0.9129 0.1570 0.3076 0.6191 2.6518 5.7900 1.1277 1.0074 0.7942 0.4844 3.3618 0.1201 1.5525 0.2239 6.6704 2.8968 5.8229 6.8332 11.8931 3.6033 3.6190 9.2322 6.0763 3.2462 29.9764 11.4185 5.9244 38.9272 1.0165 19.1589 6.4040 5.8379 144.5980 5.4358 24.0368 0.2889 8.4342 38.4782 5.0408 2.3532 23.1316 16.8831 8.7656 24.2487 4.1214 116.0562 74.5314 4.9184 18.1399 0.4081 19.1957 21.6550 3.9599 3.1735 7.3481 1.5842 0.0463 38.5185 12.4739 13.9872 13.0254 1.1816 40.8947 6.1750 24.4021 0.2697 26.3195 15.7743 24.2331 19.2854 4.0007 3.0122 82.1678 119.1814 4.7644 56.4815 35.4597 5.8852 5.5264 6.3060 56.7079 94.4104 68.8727 6.2556 86.2975 49.6908 10.9102 44.8237 46.2749 141.7346 349.6444 150.5596 12.3706 4.2589 3.8154 6.6074 1.2099 6.6903 13.8714 3.8761 19.0617 3.6689 32.4739 30.1274 34.0967
temp: 298.150 k
press: 1.00000 atm
elementType: 17 17 16 8 8 7 7 7 6 6 6 6 6 6 6 6 6 6 6 6 6 6 6 6 1 1 1 1 1 1 1 1 1 1 1 1 1
symmnumber: 1
zpe: 692039.7 jmol-1
zpe.correction: 0.263584 hartree
zpe.thermalcorrener: 0.285692 hartree
zpe.thermalcorrenthalpy: 0.286636 hartree
zpe.thermalcorrgfe: 0.207631 hartree
zpe.sumelectzpe: -2248.681502 hartree
zpe.sumelectthermal: -2248.659394 hartree
zpe.sumelectthermalent: -2248.658449 hartree
zpe.sumelectthermalfe: -2248.737454 hartree
dipole: -5.6001 3.1627 -3.8401
dipole: 7.4907
quadrupole: -162.3908 -153.5717 -166.4419
quadrupole: -15.1619 6.1117 7.2229
quadrupole: -1.5893 7.2297 -5.6404 -15.1619 6.1117 7.2229
hfenergy: -2248.9450855 hartree
pointgroup: C01 [X(C16H13Cl2N3O2S1)]
dipole: -2.2490184 -1.3204367 1.3724109 debye
polarizability: 290.6315076|15.9945096|283.2543124|-24.5905665|16.5248449|133.1531867 unknown
InChI: InChI=1S/C16H13Cl2N3O2S/c17-9-4-3-6-11(15(9)18)20-21-14(22)8-13-16(23)19-10-5-1-2-7-12(10)24-13/h1-7,13,19-21H,8H2
charge 0 multiplicity 1
37 atoms
Cl 5.55004 1.448496 0.725537
Cl 6.678639 -1.56897 0.161448
S  -1.747112 0.154162 -1.379766
O  -3.524648 3.038464 0.616834
O  1.246102 2.391092 -1.52775
N  -4.147834 0.815623 0.460593
N  1.200299 1.915989 0.75457
N  2.556559 1.600956 0.842854
C  -1.764563 1.411463 0.05635
C  -0.896854 2.62668 -0.324836
C  -3.205934 1.836824 0.379554
C  -2.905113 -1.0385 -0.613439
C  -3.967948 -0.572243 0.208276
C  0.596256 2.30437 -0.454569
C  -2.786387 -2.416971 -0.896289
C  -4.896196 -1.501737 0.741649
C  -3.726296 -3.33577 -0.37877
C  -4.781264 -2.874508 0.442898
C  3.010404 0.300975 0.539676
C  4.410913 0.047801 0.483519
C  2.119562 -0.784824 0.331206
C  4.894956 -1.249265 0.23414
C  2.620532 -2.077753 0.08686
C  4.009437 -2.329071 0.038891
H  -1.354625 0.875465 0.934268
H  -1.06824 3.416012 0.431122
H  -1.230424 3.034997 -1.292528
H  -5.075446 1.125711 0.767165
H  -1.961524 -2.766286 -1.5264
H  -5.707024 -1.14299 1.387159
H  0.683292 1.956174 1.636996
H  -3.630236 -4.401187 -0.610162
H  -5.508848 -3.581256 0.854775
H  3.211253 2.375004 0.696561
H  1.042312 -0.597727 0.335286
H  1.921005 -2.903925 -0.076386
H  4.404054 -3.330079 -0.151294
