program: Gaussian 09
title: 000018380
version: EM64L-G09RevD.01
frameworkgroup: C1[X(C17H26O3)]
method: RPBEPBE
basis: SDD
operation: Freq
keyword: #pfreq=noraman
keyword: PBEPBE/SDD
title: #p freq=noraman PBEPBE/SDD
converged: YES YES NO NO
title: Mulliken charges:
elementType: O O O C C C C C C C C C C C C C C C C C H H H H H H H H H H H H H H H H H H H H H H H H H H
charge: -0.249128 -0.425986 -0.190150 -0.387239 -0.381185 -0.365969 -0.372332 -0.389901 -0.353543 -0.570315 -0.356370 0.513684 -0.696590 -0.376320 -0.444781 -0.379661 -0.343767 0.334506 -0.338657 0.160695 0.194737 0.194980 0.191805 0.192256 0.192116 0.193226 0.189614 0.189955 0.211019 0.209087 0.187783 0.187520 0.206002 0.206266 0.194749 0.195029 0.209723 0.215131 0.209551 0.234721 0.231852 0.254313 0.240245 0.246211 0.245939 0.389179
chargesum: 0.00000
title: Mulliken charges with hydrogens summed into heavy atoms:
elementType: O O O C C C C C C C C C C C C C C C C C
charge: -0.249128 -0.036806 -0.190150 0.002477 0.002877 0.019373 0.007237 0.030205 0.021760 -0.158047 0.033407 0.513684 -0.062185 -0.141599 -0.212929 -0.125348 -0.103522 0.334506 0.153493 0.160695
polarizability: 2.83505014e+02 -2.22754886e+01 1.38724112e+02 -2.05099128e+00 -1.15852197e+00 1.73966089e+02
1716.lowfreq: -3.0256 -0.0011 0.0008 0.0016 3.7994 9.9346 13.0436 17.5110 26.3389
frequency: 12.4827 17.2924 25.0162 32.4230 40.3237 44.0734 69.1501 72.9406 85.9820 103.4383 119.0795 129.6801 138.9177 144.2516 145.5951 153.9766 212.6544 225.5685 227.8584 276.5673 299.4807 343.1327 364.5749 384.7028 413.0868 461.3035 467.4454 484.2109 510.9722 512.2718 547.4934 602.2942 626.3764 634.4301 719.9823 724.4588 725.5034 737.2700 764.0992 766.2905 810.2799 816.8466 824.2866 841.3982 879.1205 880.6582 887.8307 935.1926 949.0668 966.1608 990.5311 992.9574 1003.5589 1007.4848 1009.7338 1011.5604 1036.8734 1052.4288 1057.4882 1069.0871 1076.4747 1081.0588 1082.8713 1120.7804 1127.0076 1182.2358 1183.6287 1201.4920 1209.4725 1213.2536 1214.8898 1225.9855 1247.5876 1247.9588 1255.6901 1273.9126 1279.6310 1282.1316 1286.3535 1294.1483 1296.4782 1309.1041 1315.1705 1336.4979 1349.3388 1354.9247 1356.1306 1369.4138 1387.6438 1390.4738 1416.2146 1452.1824 1460.0718 1460.4653 1464.4143 1465.2009 1469.9447 1475.4362 1476.2546 1481.4602 1486.5030 1488.5463 1501.1075 1586.1869 1623.8357 1706.5832 2948.9690 2949.9206 2950.9062 2954.6234 2956.0848 2961.0302 2966.5032 2967.7312 2971.1196 2975.5210 2982.6187 2987.3556 2995.4696 3006.8781 3009.5829 3015.7846 3026.4777 3038.0365 3047.4244 3067.5854 3070.0804 3121.2351 3124.4034 3156.3164 3167.4290 3528.1021
redmass: 4.6040 5.9032 2.1946 5.1020 4.2761 2.8484 3.3063 2.4190 3.1066 2.6772 1.9547 2.7406 3.6376 5.3206 2.0825 1.9950 4.2960 2.6947 1.4393 4.0647 4.0662 3.2738 3.7484 3.8824 2.9454 3.3881 3.1758 4.7833 1.8216 3.2333 3.0468 4.7885 1.5290 6.7964 1.0604 1.0755 3.6157 1.1040 2.2241 1.5801 1.4547 1.2948 2.8191 1.7683 1.8394 2.0071 1.8979 1.3956 1.2362 1.3646 4.3909 4.3315 3.4681 1.8841 3.3823 1.1631 3.5284 3.0466 2.7971 2.6718 1.3477 2.2008 2.2213 2.6594 1.2458 1.2565 1.7369 1.0775 1.2696 1.6100 1.8932 4.6979 1.3321 1.3397 1.7116 1.1891 1.0580 1.3363 1.0821 1.1314 1.1041 1.2855 1.3722 1.4371 1.5521 1.6710 1.6233 2.1941 1.2174 2.9362 3.1498 1.1059 1.0756 1.0741 1.0649 1.0806 1.0834 1.0747 1.0516 1.0880 1.0921 1.0962 2.5266 6.9682 6.5287 9.3021 1.0587 1.0588 1.0592 1.0593 1.0553 1.0590 1.0592 1.0586 1.0366 1.0597 1.0964 1.0980 1.1003 1.1018 1.1033 1.1027 1.1045 1.1047 1.1045 1.1007 1.0993 1.0891 1.0892 1.0942 1.0952 1.0643
irintensity: 0.8221 0.2341 0.5050 0.0105 0.1871 0.1126 0.0581 0.1414 0.9507 0.6834 0.0584 5.6347 1.0263 2.0552 0.0279 0.0156 0.7683 0.4764 0.1590 0.3710 1.8586 0.7026 3.7998 1.7402 0.0599 0.4848 2.9516 8.9658 30.2405 27.3908 24.5548 25.9578 133.6105 0.1417 15.3727 0.0164 0.9937 4.4375 6.8227 6.5995 24.2672 6.2155 3.9886 44.1052 0.2428 1.3786 4.6274 0.1944 0.4442 0.4812 1.1030 0.4829 67.9650 0.6097 322.4714 0.6024 2.7370 2.8861 82.6105 0.3381 3.8312 0.2185 0.4753 17.2196 12.6756 44.0246 3.5132 0.3387 16.1663 18.1622 44.9334 171.9985 0.4896 0.7471 6.1810 0.0578 0.4023 0.3161 0.2506 0.0615 0.2221 1.6977 0.7509 0.7747 0.4664 0.3337 0.4792 24.9529 11.2017 0.1810 4.3009 71.3982 0.0089 0.0429 0.0206 0.2966 0.3123 3.4177 9.9755 1.3380 0.5243 36.7064 151.1019 10.9200 30.9376 215.2612 1.6350 0.1608 3.2855 0.1185 50.3099 41.3214 9.5384 126.2222 37.5432 121.1013 0.1805 0.5868 0.6576 1.4783 18.7160 0.4025 1.0469 66.1751 167.2708 98.4628 55.3206 15.4060 23.9015 17.5219 3.7939 34.9204
temp: 298.150 k
press: 1.00000 atm
elementType: 8 8 8 6 6 6 6 6 6 6 6 6 6 6 6 6 6 6 6 6 1 1 1 1 1 1 1 1 1 1 1 1 1 1 1 1 1 1 1 1 1 1 1 1 1 1
symmnumber: 1
zpe: 1034186.8 jmol-1
zpe.correction: 0.393901 hartree
zpe.thermalcorrener: 0.416709 hartree
zpe.thermalcorrenthalpy: 0.417653 hartree
zpe.thermalcorrgfe: 0.336371 hartree
zpe.sumelectzpe: -887.515985 hartree
zpe.sumelectthermal: -887.493177 hartree
zpe.sumelectthermalent: -887.492233 hartree
zpe.sumelectthermalfe: -887.573515 hartree
dipole: -0.7072 0.0835 -2.6802
dipole: 2.7732
quadrupole: -115.7891 -123.8608 -121.5584
quadrupole: -4.1106 -19.5889 2.9404
quadrupole: 4.6137 -3.4580 -1.1556 -4.1106 -19.5889 2.9404
hfenergy: -887.9098859 hartree
pointgroup: C01 [X(C17H26O3)]
dipole: 0.2832065 -0.948409 0.4590347 debye
polarizability: 282.9810227|12.0451031|167.542168|20.7459674|-13.5504496|145.6720246 unknown
InChI: InChI=1S/C17H26O3/c1-2-3-4-5-6-7-8-9-15-10-12-16(13-11-15)20-14-17(18)19/h10-13,18H,2-9,14H2,1H3
charge 0 multiplicity 1
46 atoms
O  -5.002366 0.375669 -0.483718
O  -8.008574 -1.634577 -0.778686
O  -7.544288 0.496172 -1.603524
C  3.938443 0.010776 -0.076255
C  5.392642 0.052659 0.445397
C  2.885035 0.256228 1.027424
C  6.446404 -0.183915 -0.660036
C  1.432415 0.200652 0.505333
C  7.900909 -0.150083 -0.138838
C  0.379822 0.462881 1.618166
C  8.953677 -0.383659 -1.246463
C  -1.051594 0.414191 1.105128
C  10.404286 -0.350101 -0.718425
C  -1.602287 1.50803 0.381064
C  -1.867776 -0.724809 1.297347
C  -2.910895 1.465791 -0.131973
C  -3.187516 -0.791676 0.789863
C  -3.705406 0.311782 0.071639
C  -5.849476 -0.785503 -0.29771
C  -7.18421 -0.511435 -0.975089
H  3.814043 0.770225 -0.876338
H  3.748426 -0.974142 -0.551899
H  5.518655 -0.711648 1.240824
H  5.581142 1.03518 0.926943
H  3.068905 1.245708 1.496928
H  3.014974 -0.497447 1.832502
H  6.254502 -1.163991 -1.145334
H  6.323663 0.583618 -1.452864
H  1.236244 -0.790244 0.048125
H  1.298705 0.947306 -0.30372
H  8.094192 0.828785 0.348354
H  8.026202 -0.919662 0.651696
H  0.587854 1.454003 2.069852
H  0.51897 -0.286713 2.421907
H  8.758539 -1.361279 -1.733147
H  8.828238 0.385869 -2.035571
H  10.634655 0.627894 -0.254919
H  11.135883 -0.519952 -1.529883
H  10.564659 -1.130096 0.049885
H  -0.996605 2.409027 0.223367
H  -1.471194 -1.580967 1.856971
H  -3.339872 2.306581 -0.685472
H  -3.784167 -1.692284 0.965575
H  -6.035294 -0.994554 0.77628
H  -5.406039 -1.697388 -0.749341
H  -8.889023 -1.479604 -1.215663
