program: Gaussian 09
title: 000232936
version: EM64L-G09RevD.01
frameworkgroup: C1[X(C13H12N4OS2)]
method: RPBEPBE
basis: SDD
operation: Freq
keyword: #p
keyword: freq=noraman
keyword: PBEPBE/SDD
title: #p freq=noraman PBEPBE/SDD
converged: YES YES NO NO
title: Mulliken charges:
elementType: S S O N N N N C C C C C C C C C C C C C H H H H H H H H H H H H
charge: 0.249762 0.161937 -0.204102 -0.277608 -0.352386 0.027369 0.003684 0.278419 -0.132690 0.385947 -0.245984 0.019259 -0.403040 -0.346303 -0.210492 -0.206061 -0.201859 -0.233621 -0.799050 -0.820787 0.347322 0.273472 0.274631 0.240350 0.240100 0.240774 0.236739 0.293421 0.291475 0.341454 0.264575 0.263291
chargesum: 0.00000
title: Mulliken charges with hydrogens summed into heavy atoms:
elementType: S S O N N N N C C C C C C C C C C C C C
charge: 0.249762 0.161937 -0.204102 -0.277608 -0.005064 0.027369 0.003684 0.278419 -0.132690 0.385947 -0.245984 0.019259 -0.129568 -0.071672 -0.210492 0.034290 0.038241 0.007153 0.022585 0.048533
polarizability: 2.86892942e+02 7.41509183e-01 2.54781570e+02 1.18672902e+01 -5.68900583e+00 1.10856073e+02
1716.lowfreq: -5.4712 -0.0027 -0.0023 -0.0023 0.7925 6.6845 35.7132 41.2662 44.5084
frequency: 35.7110 41.2359 44.4887 50.6174 57.9268 82.9485 108.4354 118.2096 136.5790 144.8451 163.5883 165.4707 204.2108 214.5446 234.2175 273.1056 290.5244 326.1344 359.7131 377.8831 407.9038 411.7208 467.6635 508.6882 532.7064 540.9463 608.5059 616.9681 626.5182 638.1147 648.8570 655.9914 659.6520 670.4594 700.7984 710.4112 759.8142 768.2428 785.8471 851.4177 907.8584 929.5367 954.7493 970.7475 980.2809 987.0307 988.3207 989.3998 1002.4447 1004.2418 1016.3480 1025.6801 1081.2341 1100.0722 1153.9077 1176.4354 1181.0927 1185.6730 1269.5836 1316.3682 1330.2264 1335.0557 1344.5990 1359.1402 1380.2799 1408.6896 1432.6392 1444.4382 1449.0824 1453.3545 1472.0162 1484.4001 1516.1251 1529.0542 1584.8230 1597.4301 1608.9807 1639.0695 2984.3621 3029.9507 3116.2013 3135.4479 3142.7772 3153.7483 3157.9535 3159.0116 3163.9177 3165.3890 3176.1876 3516.9068
redmass: 4.7541 5.5908 3.8187 3.7187 4.9876 4.7927 4.0466 1.5320 2.8353 1.2951 5.1039 4.3956 5.1113 4.4513 4.7217 8.4692 8.3169 9.7350 7.7753 8.0513 2.9281 7.7479 6.5265 4.5325 11.1048 1.2153 7.0190 8.5963 8.1867 12.3319 7.5177 8.0367 8.9855 7.8927 2.8052 3.9530 2.6003 9.9522 3.4526 1.2388 6.8115 1.5021 8.6125 5.2149 1.3992 1.3077 1.1803 3.5901 1.3300 1.2964 1.3120 2.1062 1.6031 4.4259 4.0911 1.0680 4.0939 1.2564 6.4198 1.3898 3.5300 1.1296 1.2367 3.6553 8.0458 4.9627 1.0514 2.2540 1.0499 1.1016 1.0564 2.5110 4.4465 6.4804 8.5254 7.2532 6.1303 12.0211 1.0347 1.0277 1.0958 1.0867 1.0884 1.0928 1.1072 1.1050 1.0967 1.1063 1.1017 1.0788
irintensity: 3.9420 0.1418 2.3419 0.0044 0.6603 7.6832 1.0961 1.8757 0.0357 1.0053 0.3680 10.4276 5.1661 2.2912 2.8063 3.2534 0.4839 0.9433 12.5216 6.7053 0.9123 5.2238 13.3592 3.4901 1.4771 84.1348 1.5970 0.6933 7.5711 5.7622 6.5575 18.2585 8.4945 2.9731 22.8259 48.3015 23.4803 8.5425 13.5302 1.1341 37.5672 7.9175 15.3319 9.9751 1.8020 4.2060 5.4867 1.7373 0.2514 8.1462 48.4221 5.7799 8.5388 75.9444 260.1959 0.5401 33.9130 13.8611 3.9510 0.7952 77.4870 16.8469 21.1471 104.8635 1.0042 48.7940 14.6208 6.5375 7.3690 29.9833 15.1473 58.2573 166.2531 429.7257 168.8554 55.7263 40.8432 390.4984 64.0818 19.9904 1.4970 3.1949 1.2887 15.0457 11.1110 6.2118 13.8845 5.7196 11.2763 50.3140
temp: 298.150 k
press: 1.00000 atm
elementType: 16 16 8 7 7 7 7 6 6 6 6 6 6 6 6 6 6 6 6 6 1 1 1 1 1 1 1 1 1 1 1 1
symmnumber: 1
zpe: 607068.2 jmol-1
zpe.correction: 0.231220 hartree
zpe.thermalcorrener: 0.250437 hartree
zpe.thermalcorrenthalpy: 0.251381 hartree
zpe.thermalcorrgfe: 0.181613 hartree
zpe.sumelectzpe: -1591.507666 hartree
zpe.sumelectthermal: -1591.488448 hartree
zpe.sumelectthermalent: -1591.487504 hartree
zpe.sumelectthermalfe: -1591.557273 hartree
dipole: -4.7534 -7.3331 -0.1585
dipole: 8.7404
quadrupole: -120.3382 -133.9874 -128.3355
quadrupole: -13.0519 3.2679 -1.7080
quadrupole: 7.2155 -6.4337 -0.7818 -13.0519 3.2679 -1.7080
hfenergy: -1591.7388856 hartree
pointgroup: C01 [X(C13H12N4O1S2)]
dipole: -2.886078 1.8476542 -0.285721 debye
polarizability: 282.3683435|12.4879893|257.4515556|3.0962695|-20.1223103|112.7106859 unknown
InChI: InChI=1S/C13H12N4OS2/c1-19-12-15-10-9(11(18)16-12)14-13(20-2)17(10)8-6-4-3-5-7-8/h3-7,15H,1-2H3
charge 0 multiplicity 1
32 atoms
S  -2.260482 -2.882716 0.189596
S  2.792711 3.275296 0.261678
O  3.554175 -1.792775 0.582783
N  -0.912814 -0.398794 0.165933
N  0.861874 1.369845 0.200662
N  0.462378 -2.22557 0.375501
N  3.096101 0.519649 0.417134
C  0.402447 0.064189 0.220738
C  1.244203 -1.052097 0.353665
C  -2.097266 0.408688 0.022828
C  -0.804633 -1.818873 0.267705
C  2.699736 -0.880063 0.462183
C  -2.191047 1.320572 -1.057775
C  -3.148286 0.292571 0.963037
C  2.255585 1.511604 0.306509
C  -3.342055 2.12867 -1.186615
C  -4.30214 1.091478 0.812695
C  -4.399587 2.014644 -0.254645
C  -1.353178 -4.533792 0.272791
C  4.646872 3.030306 0.461976
H  0.236899 2.178204 0.144463
H  -1.391697 1.367081 -1.80591
H  -3.05846 -0.411419 1.796202
H  -3.418587 2.831936 -2.022473
H  -5.11968 0.999462 1.535178
H  -5.294402 2.636463 -0.362025
H  -2.142946 -5.299934 0.246101
H  -0.775331 -4.583249 1.205337
H  -0.678804 -4.620207 -0.589626
H  4.798827 1.936641 0.509994
H  4.9659 3.51705 1.393915
H  5.150489 3.463138 -0.413536
