program: Gaussian 09
title: 000232919
version: EM64L-G09RevD.01
frameworkgroup: C1[X(C12H13NO2)]
method: RPBEPBE
basis: SDD
operation: Freq
keyword: #p
keyword: freq=noraman
keyword: PBEPBE/SDD
title: #p freq=noraman PBEPBE/SDD
converged: YES YES NO NO
title: Mulliken charges:
elementType: O O N C C C C C C C C C C C C H H H H H H H H H H H H H
charge: -0.313630 -0.236619 -0.448265 0.292778 0.226906 0.235172 -0.485737 -0.608175 0.455235 -0.359557 -0.332635 0.145675 -0.819205 -0.211525 -0.676454 0.281003 0.333101 0.246955 0.234604 0.228099 0.227956 0.227902 0.225257 0.230266 0.230049 0.215292 0.227730 0.227824
chargesum: 0.00000
title: Mulliken charges with hydrogens summed into heavy atoms:
elementType: O O N C C C C C C C C C C C C
charge: -0.313630 -0.236619 -0.115164 0.292778 0.226906 0.235172 -0.204734 -0.361220 0.455235 -0.124953 -0.104536 0.145675 -0.138090 0.248790 -0.005609
polarizability: 2.59658506e+02 -1.15083059e+01 1.43723211e+02 -9.70479305e-02 -8.26162176e-02 7.15474775e+01
1716.lowfreq: -3.3237 -2.7352 -0.0007 -0.0006 0.0000 10.7264 33.6751 57.5891 64.2390
frequency: 33.5696 57.5265 64.1735 70.7297 92.6628 123.2593 183.1657 187.2776 244.6623 269.1498 274.0770 314.1381 342.9502 346.4313 399.4919 435.7955 506.9146 519.9584 580.7202 601.1885 607.9463 614.9693 719.1042 736.1200 758.5947 760.3841 799.2544 803.1195 816.2075 839.0160 845.7028 896.7857 931.2848 947.5274 951.6107 1000.7034 1027.5261 1048.2249 1060.6495 1111.3197 1136.7506 1140.3534 1145.4877 1196.5387 1226.9581 1242.9847 1248.4289 1308.1788 1319.8494 1359.4177 1385.6540 1397.1247 1399.4490 1415.5816 1458.5107 1463.2363 1463.3820 1469.1266 1475.6547 1487.3641 1495.2309 1543.1257 1582.8864 1639.3414 1642.0004 2973.2119 2994.8100 3009.7737 3049.5926 3067.1194 3082.7877 3091.7976 3105.3631 3120.7882 3133.1855 3148.5376 3231.3605 3608.1910
redmass: 2.8733 2.1549 1.1572 4.0420 7.0625 2.7543 3.4595 4.4372 1.3411 4.0502 3.5963 4.3655 4.3216 4.4498 3.7522 3.0095 5.0313 4.7947 3.9374 3.0077 1.2322 5.8334 4.6900 6.6020 6.3287 3.6467 1.0980 1.4817 3.8346 3.5579 1.3986 1.5012 2.7968 1.3378 6.3217 1.5101 2.3748 1.5359 3.3151 2.1942 1.4677 1.6013 1.4449 2.6803 1.3895 2.1102 1.1323 2.1042 3.0003 1.5357 4.8057 1.2361 1.3081 2.9615 4.5323 1.6075 1.0409 1.0456 1.0577 1.0869 2.0399 5.8572 5.7575 7.8575 10.5923 1.0373 1.0356 1.0582 1.0977 1.1065 1.0984 1.0985 1.1027 1.0876 1.0923 1.0968 1.0984 1.0807
irintensity: 0.0152 2.0438 0.0428 0.3611 0.1089 0.5377 2.8610 2.4002 0.1061 5.5869 4.0949 0.5211 13.7383 0.2091 1.0973 9.8333 1.1626 4.1857 1.1962 18.3085 64.3366 10.2795 33.8678 0.7591 11.0802 0.0222 2.5330 45.1225 2.9048 1.7353 29.2644 23.8135 0.4587 2.5881 98.9536 13.5997 56.3154 11.8661 262.9883 3.0715 5.4677 57.3402 71.0087 248.7407 124.5830 37.6129 0.0005 17.6082 63.7005 5.6615 31.6811 5.6724 15.6813 9.7851 23.8885 19.1503 12.2706 12.9896 7.0360 7.1903 3.0194 80.3886 3.3466 93.4331 374.3488 50.6576 22.4313 24.4824 23.6373 7.3145 18.4684 33.8530 47.5509 8.0662 18.1893 19.3294 0.1402 92.0097
temp: 298.150 k
press: 1.00000 atm
elementType: 8 8 7 6 6 6 6 6 6 6 6 6 6 6 6 1 1 1 1 1 1 1 1 1 1 1 1 1
symmnumber: 1
zpe: 587264.9 jmol-1
zpe.correction: 0.223677 hartree
zpe.thermalcorrener: 0.237933 hartree
zpe.thermalcorrenthalpy: 0.238877 hartree
zpe.thermalcorrgfe: 0.181396 hartree
zpe.sumelectzpe: -669.217750 hartree
zpe.sumelectthermal: -669.203495 hartree
zpe.sumelectthermalent: -669.202551 hartree
zpe.sumelectthermalfe: -669.260032 hartree
dipole: 0.0150 3.2681 0.0024
dipole: 3.2681
quadrupole: -69.9838 -86.1435 -91.6041
quadrupole: 9.0382 -0.0036 -0.0312
quadrupole: 12.5933 -3.5663 -9.0270 9.0382 -0.0036 -0.0312
hfenergy: -669.4414277 hartree
pointgroup: C01 [X(C12H13N1O2)]
dipole: 0.0223206 1.2850863 -0.0354738 debye
polarizability: 260.1058497|8.9326693|143.2255568|-0.8611381|-1.8617768|71.5977872 unknown
InChI: InChI=1S/C12H13NO2/c1-3-15-12(14)11-7-9-6-8(2)4-5-10(9)13-11/h4-7,13H,3H2,1-2H3
charge 0 multiplicity 1
28 atoms
O  -3.091564 0.375607 0.008187
O  -2.907787 -1.965691 0.069324
N  -0.416998 0.750263 -0.007667
C  1.357417 -0.694328 0.021632
C  0.97419 0.698735 -0.011539
C  -0.925795 -0.56003 0.026836
C  0.143803 -1.467664 0.045573
C  2.740092 -1.034321 0.024456
C  3.711196 -0.016741 -0.004786
C  1.938171 1.733265 -0.041029
C  3.292142 1.357376 -0.037163
C  -2.362274 -0.835043 0.038307
C  5.195696 -0.342865 -0.002598
C  -4.576734 0.235097 0.014509
C  -5.157426 1.644878 -0.031346
H  0.038606 -2.550285 0.072745
H  -1.01198 1.576577 -0.026434
H  3.04738 -2.086203 0.049368
H  1.647776 2.789058 -0.066112
H  4.062084 2.138638 -0.059649
H  5.697381 0.054483 -0.9054
H  5.70498 0.101374 0.873709
H  5.369842 -1.432145 0.025441
H  -4.871891 -0.372892 -0.859892
H  -4.869848 -0.313951 0.927745
H  -6.261439 1.5933 -0.028383
H  -4.836907 2.233848 0.845235
H  -4.838908 2.174359 -0.94577
