program: Gaussian 09
title: 000232951
version: EM64L-G09RevD.01
frameworkgroup: C1[X(C16H13Cl2N3O2S)]
method: RPBEPBE
basis: SDD
operation: Freq
keyword: #p
keyword: freq=noraman
keyword: PBEPBE/SDD
title: #p freq=noraman PBEPBE/SDD
converged: YES YES NO NO
title: Mulliken charges:
elementType: Cl Cl S O O N N N C C C C C C C C C C C C C C C C H H H H H H H H H H H H H
charge: -0.035832 -0.018928 0.270216 -0.234412 -0.220291 -0.429752 -0.370317 -0.376397 -0.557208 -0.510135 0.201602 -0.340846 0.558675 0.191996 -0.265099 -0.389240 -0.239775 -0.206956 0.503194 -0.299436 -0.436735 -0.041675 -0.173131 -0.139598 0.291956 0.274833 0.279504 0.333562 0.259896 0.238068 0.319031 0.240092 0.236097 0.314112 0.282355 0.235019 0.255552
chargesum: 0.00000
title: Mulliken charges with hydrogens summed into heavy atoms:
elementType: Cl Cl S O O N N N C C C C C C C C C C C C C C C C
charge: -0.035832 -0.018928 0.270216 -0.234412 -0.220291 -0.096190 -0.051285 -0.062284 -0.265252 0.044202 0.201602 -0.340846 0.558675 0.191996 -0.005202 -0.151172 0.000317 0.029141 0.503194 -0.017081 -0.201716 -0.041675 0.082421 -0.139598
polarizability: 2.80187747e+02 8.52740331e+00 2.99414793e+02 1.95084295e+01 -3.88403240e-01 1.27686969e+02
1716.lowfreq: -2.0465 -0.0020 -0.0019 0.0009 1.7421 5.9214 13.1825 24.3170 29.1286
frequency: 12.7134 24.2269 29.1167 32.0961 44.4056 63.7446 87.2693 94.9436 106.8738 159.6620 173.9068 178.5803 185.2864 220.1153 238.6504 250.8285 281.2605 289.2093 295.6071 316.4470 338.2926 381.5745 397.7295 402.5843 427.8029 436.2303 438.9190 450.6177 460.3525 498.2186 515.8454 533.1317 537.1147 571.4123 589.7126 625.0283 644.7944 657.6686 670.8048 677.7337 683.7297 687.9293 711.1748 724.9145 730.2114 763.7400 801.3803 850.9698 868.0352 874.2234 886.2293 901.8229 913.6440 935.2483 945.9458 955.4696 983.4599 992.2728 1029.6109 1052.3319 1077.9540 1106.0023 1119.2605 1132.4418 1143.3462 1172.5946 1175.1092 1209.5704 1224.0488 1238.7466 1250.4805 1257.8135 1265.9058 1305.4168 1314.3301 1352.2263 1361.5575 1369.7661 1402.4177 1405.6045 1438.1291 1455.9992 1457.8504 1466.7374 1474.1050 1486.7369 1580.9116 1587.2857 1599.4130 1609.1247 1623.0396 1636.0959 2995.9024 3014.1969 3097.2257 3126.8468 3140.1816 3143.6570 3154.9478 3159.9628 3172.2750 3173.8410 3505.4961 3514.8701 3518.6547
redmass: 8.4009 9.2491 11.4224 9.3219 8.2626 6.9687 7.0748 7.3375 6.6680 5.6726 5.7976 8.8219 12.0347 6.4145 2.9078 5.6525 6.2844 4.7874 3.9391 5.7636 3.8057 7.5778 6.6269 6.0529 7.4623 3.3153 3.9460 2.4334 4.4912 2.9036 4.2389 1.9204 3.8517 4.3994 5.3430 2.4657 5.2244 6.3557 4.4967 3.3641 3.3144 3.6011 3.9917 3.1417 2.9654 1.3636 1.4231 3.3963 1.6808 1.5078 5.1902 3.4675 5.6491 1.3485 1.3902 2.7639 1.3297 4.8084 3.4474 2.9902 2.3197 2.3607 2.1428 1.6815 1.4047 1.7427 1.0625 1.5743 2.0298 1.7214 1.4374 1.4614 1.6147 2.5821 2.3636 2.1320 4.4402 3.7692 4.9126 2.2689 1.1293 1.4657 2.4687 2.3123 2.6253 1.5803 5.2527 7.0964 6.4182 6.9525 5.3525 7.3491 1.0831 1.0649 1.0963 1.0886 1.0894 1.0882 1.0942 1.0923 1.0959 1.1007 1.0772 1.0759 1.0781
irintensity: 1.6484 0.7417 0.8891 2.5693 0.0706 7.1598 1.4347 0.4678 3.1132 0.8220 2.4535 0.7813 0.6619 3.4569 13.2167 3.0048 3.5226 4.1907 4.7134 2.2180 7.2050 0.4584 10.0740 18.0769 1.4359 25.5190 3.4190 11.0826 33.8057 27.4892 4.9117 223.0535 1.9191 5.1529 7.6499 3.2534 8.7112 5.6789 21.7335 50.1933 5.1429 9.2487 1.9151 20.8850 5.1129 121.7010 44.7407 3.8976 1.1016 21.0251 15.8121 13.4004 4.5930 0.0741 3.3844 10.0648 0.0140 22.2951 11.4939 9.2006 3.9915 20.0567 55.8791 0.3166 3.2040 6.7332 0.2118 19.9399 65.0065 16.3183 4.3519 56.8238 1.5154 38.5537 68.4067 62.8215 35.6813 3.4434 0.7466 5.3220 49.7758 45.0698 5.8237 139.9945 88.5203 69.7481 18.7536 32.6112 50.8857 96.0958 374.8483 141.4454 16.1992 3.2995 2.4486 6.2905 7.8003 2.9709 8.6971 14.7742 5.6139 18.4368 24.0024 34.4773 25.7930
temp: 298.150 k
press: 1.00000 atm
elementType: 17 17 16 8 8 7 7 7 6 6 6 6 6 6 6 6 6 6 6 6 6 6 6 6 1 1 1 1 1 1 1 1 1 1 1 1 1
symmnumber: 1
zpe: 691746.2 jmol-1
zpe.correction: 0.263472 hartree
zpe.thermalcorrener: 0.285579 hartree
zpe.thermalcorrenthalpy: 0.286523 hartree
zpe.thermalcorrgfe: 0.208682 hartree
zpe.sumelectzpe: -2248.682753 hartree
zpe.sumelectthermal: -2248.660646 hartree
zpe.sumelectthermalent: -2248.659702 hartree
zpe.sumelectthermalfe: -2248.737543 hartree
dipole: -2.7351 0.7724 -4.8093
dipole: 5.5863
quadrupole: -153.1915 -157.2339 -165.1867
quadrupole: -26.2146 3.1039 9.7317
quadrupole: 5.3458 1.3035 -6.6493 -26.2146 3.1039 9.7317
hfenergy: -2248.946225 hartree
pointgroup: C01 [X(C16H13Cl2N3O2S1)]
dipole: 0.9977271 0.3125993 1.9332018 debye
polarizability: 275.3424599|-2.6306666|299.6488168|28.281125|-17.9729786|132.2982326 unknown
InChI: InChI=1S/C16H13Cl2N3O2S/c17-10-6-5-9(7-11(10)18)20-21-15(22)8-14-16(23)19-12-3-1-2-4-13(12)24-14/h1-7,14,19-21H,8H2
charge 0 multiplicity 1
37 atoms
Cl -2.168373 2.756635 -1.058268
Cl -5.465651 2.779528 -1.031284
S  1.383441 -0.190945 -1.225449
O  3.87679 -2.833634 0.216132
O  -1.132301 -3.271159 -1.231861
N  4.070613 -0.525124 0.248957
N  -1.035797 -2.185003 0.819111
N  -2.42598 -2.08197 0.9477
C  1.79855 -1.517059 0.083491
C  1.093742 -2.836556 -0.274957
C  3.322461 -1.697486 0.169311
C  2.372581 1.139079 -0.446517
C  3.604035 0.817776 0.188083
C  -0.438167 -2.77879 -0.302223
C  1.946302 2.481878 -0.533057
C  4.401146 1.860252 0.724544
C  2.755114 3.516503 -0.012178
C  3.983601 3.202398 0.614911
C  -3.101843 -0.946498 0.430251
C  -2.395754 0.1918 -0.03287
C  -4.523356 -0.937584 0.433115
C  -3.114297 1.318801 -0.472159
C  -5.222433 0.195232 -0.019909
C  -4.523302 1.336413 -0.470422
H  1.450403 -1.101324 1.04953
H  1.430627 -3.613895 0.437195
H  1.416177 -3.175207 -1.272976
H  5.0740 -0.67493 0.393987
H  0.985361 2.712315 -1.004878
H  5.345157 1.613823 1.225424
H  -0.484625 -1.885529 1.626476
H  2.422233 4.556333 -0.087593
H  4.611202 3.999407 1.02666
H  -2.916064 -2.978809 0.878973
H  -1.303475 0.18996 -0.084037
H  -5.080763 -1.810465 0.790224
H  -6.316159 0.204037 -0.022338
