program: Gaussian 09
title: 000232913
version: EM64L-G09RevD.01
frameworkgroup: C1[X(C6H11ClS)]
method: RPBEPBE
basis: SDD
operation: Freq
keyword: #p
keyword: freq=noraman
keyword: PBEPBE/SDD
title: #p freq=noraman PBEPBE/SDD
converged: YES YES NO NO
title: Mulliken charges:
elementType: Cl S C C C C C C H H H H H H H H H H H
charge: -0.082390 0.153593 -0.440552 -0.323002 -0.415355 -0.387877 -0.428189 -0.830671 0.296526 0.295172 0.228751 0.242495 0.241923 0.227303 0.218732 0.227436 0.275302 0.245095 0.255709
chargesum: 0.00000
title: Mulliken charges with hydrogens summed into heavy atoms:
elementType: Cl S C C C C C C
charge: -0.082390 0.153593 -0.144025 -0.027831 0.055891 0.081349 0.017979 -0.054566
polarizability: 1.02875003e+02 7.81967115e+00 9.34374842e+01 -1.03434954e+00 3.78324360e+00 6.37596194e+01
1716.lowfreq: -27.7497 -12.4174 0.0018 0.0028 0.0038 7.7719 23.0037 56.8638 130.3025
frequency: -17.8997 56.7944 130.2331 145.8632 165.7583 206.5341 273.3409 301.8489 358.4784 451.1172 589.1150 654.5087 666.9782 739.2004 821.1663 874.2081 906.3846 926.5666 947.6639 970.5657 987.9690 1039.3045 1077.5909 1103.8772 1118.6191 1148.0882 1197.8942 1211.8204 1239.0610 1257.4434 1280.0115 1297.3656 1308.0880 1313.0590 1347.3002 1445.4869 1461.1966 1466.0671 1468.4525 1481.1126 3004.0940 3008.5824 3012.2126 3015.5441 3042.7180 3065.4729 3072.9104 3082.7096 3097.1449 3124.4214 3139.3184
redmass: 2.9277 2.7884 1.1202 3.8402 2.2882 4.3268 3.3132 4.0843 6.4723 3.2519 2.4401 4.2143 3.1376 5.6831 1.7569 1.6771 2.4234 2.3988 2.0799 1.1991 1.2738 1.8829 2.6766 3.5361 1.2832 1.1899 1.2489 1.3459 1.1882 1.2719 1.2054 1.2131 1.4258 1.4300 1.1356 1.0528 1.0537 1.0821 1.0820 1.0943 1.0619 1.0293 1.0627 1.0639 1.0862 1.0998 1.0912 1.1025 1.1016 1.1036 1.1049
irintensity: 1.3511 3.3868 0.4717 2.0922 0.5909 0.1003 3.3504 1.9688 6.9043 2.2991 2.2102 0.4416 3.3615 36.8449 11.1773 4.4220 3.5509 8.1943 5.8314 7.2175 6.0749 0.2547 6.8109 0.7231 0.7057 1.8939 8.4749 5.3144 7.2718 3.6633 1.3308 3.8494 11.3198 3.8791 1.4058 14.7682 16.8633 11.3777 10.8836 9.5434 33.9604 29.5386 17.9233 23.8909 5.5355 12.0659 2.2121 29.1962 48.3196 16.8674 10.1564
temp: 298.150 k
press: 1.00000 atm
elementType: 17 16 6 6 6 6 6 6 1 1 1 1 1 1 1 1 1 1 1
symmnumber: 1
zpe: 413317.3 jmol-1
zpe.correction: 0.157424 hartree
zpe.thermalcorrener: 0.166212 hartree
zpe.thermalcorrenthalpy: 0.167157 hartree
zpe.thermalcorrgfe: 0.122731 hartree
zpe.sumelectzpe: -1092.705717 hartree
zpe.sumelectthermal: -1092.696928 hartree
zpe.sumelectthermalent: -1092.695984 hartree
zpe.sumelectthermalfe: -1092.740409 hartree
dipole: -1.2355 -0.9537 0.3981
dipole: 1.6108
quadrupole: -58.6508 -70.5645 -62.7906
quadrupole: 4.8304 0.8727 -0.8475
quadrupole: 5.3512 -6.5625 1.2113 4.8304 0.8727 -0.8475
hfenergy: -1092.8631408 hartree
pointgroup: C01 [X(C6H11Cl1S1)]
dipole: 0.386725 -0.5006214 -0.037836 debye
dipolederiv: -0.274266 0.0489001 -0.0236421 0.0139219 -0.5961378 0.1560036 -0.0119667 0.2373898 -0.2799997 -0.2608324 0.0104969 -0.0565552 0.0071698 -0.1440943 -0.0987114 -0.0234089 -0.076524 -0.0904048 0.3370105 0.0639298 -0.1500954 -0.0235129 -0.0488385 0.0788875 -0.1429231 0.0878718 0.065623 0.1589633 -0.1209284 0.0734131 0.035863 0.6627264 -0.2744083 0.1183479 -0.2471615 0.2857176 -0.0178987 0.0004146 -0.0336015 -0.0446474 0.0278538 0.0434279 0.0294593 0.039103 0.1038174 -0.0519287 -0.0110469 0.0883924 0.0042332 -0.0767213 0.0858477 -0.0635712 0.0776997 0.0926433 0.0103193 0.0225284 -0.0641802 -0.0033584 0.0057636 0.0552614 0.0516596 -0.046648 0.1650932 0.0267495 -0.0589427 0.0864108 -0.0417669 0.0800962 -0.0040327 0.0780175 -0.0047299 0.0418897 -0.0536328 0.0174854 0.0085436 0.0114042 0.0502415 0.0291465 0.0120775 -0.0025052 -0.0991029 0.057548 0.0321804 0.0216535 0.000958 -0.0251579 0.0279873 0.006514 -0.0151603 -0.0729973 0.023419 0.0379525 -0.007819 0.0210447 -0.0126524 -0.0756553 -0.0114533 -0.1366374 -0.0767649 0.0164558 -0.0907683 0.0589876 -0.0775751 0.0149803 0.0561244 0.0523056 0.0950968 0.0123654 -0.0879005 -0.0753644 -0.0546699 -0.0989032 -0.000276 -0.0450026 -0.0868115 -0.0441324 0.0506061 0.0814059 0.0164627 0.0057608 0.0140929 0.0586775 -0.0068686 0.0686117 -0.0001183 -0.1183973 0.0562335 -0.0295433 0.0161294 -0.0296097 0.0633359 -0.0235399 -0.0459387 0.0230033 -0.1660654 -0.0819278 0.1212466 0.0242524 0.131124 -0.0674133 -0.0091456 0.044151 -0.0385924 0.0698804 0.0745412 -0.0624951 -0.0501378 -0.0134426 -0.1070729 0.0034803 -0.0665046 0.0308058 0.0742584 -0.1047149 0.0481582 0.0731111 0.0410153 0.0882368 0.0097584 0.076995 0.0129558 0.0791748 0.0904556 0.0293336 -0.0159536 0.0519893 0.0264525 -0.0085606 -0.0855612 0.0082833 -0.137337 unknown
polarizability: 98.770788|-10.8889344|91.3157024|-2.5501572|-12.0378976|69.985616 unknown
InChI: InChI=1S/C6H11ClS/c1-8-6-4-2-3-5(6)7/h5-6H,2-4H2,1H3
charge 0 multiplicity 1
19 atoms
Cl 0.260766 1.899085 -1.060103
S  -2.154124 -0.726682 0.659661
C  -0.548277 -0.762715 -0.34828
C  0.466109 0.346485 0.024672
C  0.211048 -2.106119 -0.076981
C  1.858335 -0.281021 -0.152564
C  1.637922 -1.707994 0.414903
C  -3.062075 0.709753 -0.157672
H  -0.832108 -0.670888 -1.410599
H  0.298104 0.718668 1.047701
H  0.264564 -2.691733 -1.011635
H  -0.316507 -2.729508 0.665374
H  2.648645 0.28994 0.362154
H  2.111013 -0.32466 -1.228464
H  1.66856 -1.684701 1.520425
H  2.413493 -2.416423 0.077321
H  -2.520423 1.653777 -0.003055
H  -4.051885 0.754006 0.323601
H  -3.183061 0.514828 -1.235259
