program: Gaussian 09
title: 000232916
version: EM64L-G09RevD.01
frameworkgroup: C1[X(C8H13NO4)]
method: RPBEPBE
basis: SDD
operation: Freq
keyword: #p
keyword: freq=noraman
keyword: PBEPBE/SDD
title: #p freq=noraman PBEPBE/SDD
converged: YES YES NO NO
title: Mulliken charges:
elementType: O O O O N C C C C C C C C H H H H H H H H H H H H H
charge: -0.263156 -0.265237 -0.231568 -0.434669 -0.136142 -0.216382 -0.402546 -0.537839 0.184019 -0.366836 0.224928 -0.317002 -0.500000 0.267654 0.227973 0.266678 0.248549 0.275458 0.240285 0.234530 0.216603 0.216470 0.340667 0.237186 0.243744 0.246634
chargesum: 0.00000
title: Mulliken charges with hydrogens summed into heavy atoms:
elementType: O O O O N C C C C C C C C
charge: -0.263156 -0.265237 -0.231568 -0.094002 -0.136142 0.051272 0.092104 -0.013832 0.184019 0.107979 0.224928 0.116071 0.227564
polarizability: 1.23852566e+02 -5.60579882e+00 1.00059762e+02 -2.56665744e+00 -2.14083748e+00 8.34408893e+01
1716.lowfreq: -9.9097 -0.0011 -0.0003 0.0001 5.9541 13.2176 28.3085 28.8962 43.5543
frequency: 28.0413 28.7968 43.5270 77.4540 82.0506 104.0996 122.6773 152.4881 203.3471 280.1931 293.2254 295.2508 307.8918 334.8828 337.6143 435.1030 489.0618 549.5642 576.4263 641.3898 673.7958 733.5324 776.3293 791.6807 813.8171 907.6009 919.2174 963.2681 976.7843 997.2917 1035.4001 1037.9822 1071.4887 1082.8052 1115.5100 1139.7126 1144.2978 1150.6694 1159.2399 1205.3988 1208.5501 1254.2954 1278.6292 1285.8933 1299.2570 1314.0037 1322.5668 1363.3578 1384.9885 1404.9149 1424.8346 1448.7688 1454.1574 1457.6898 1463.8476 1477.6527 1490.8815 1638.5274 1640.8450 2973.6112 2980.5718 2999.3075 3008.1043 3022.2420 3041.9571 3053.2426 3057.9056 3084.0714 3111.5617 3111.8537 3154.1382 3563.9279
redmass: 5.3315 5.0422 3.8866 4.2917 2.6460 1.0767 5.2676 3.3344 3.1890 3.4642 2.3633 3.2453 2.8313 1.6992 2.9868 4.6828 4.8508 3.2188 4.4944 5.6519 5.8757 4.2440 4.9662 1.2077 3.7667 4.1844 1.7896 3.3637 3.0724 3.2110 2.7121 2.8033 1.7068 2.1172 1.2648 2.0314 1.7280 1.4445 1.3861 1.8797 1.1584 2.0839 1.6642 1.7378 1.3737 1.3001 1.7105 1.2547 1.2610 2.2409 1.1844 1.0885 1.0498 1.0811 1.0505 1.0845 1.1337 9.4067 10.0012 1.0644 1.0652 1.0592 1.0295 1.0681 1.0831 1.0992 1.1005 1.1040 1.1040 1.0978 1.1051 1.0663
irintensity: 0.9677 0.8220 0.8582 5.6222 8.4032 0.3176 0.7117 7.9299 4.5803 2.6594 18.2981 8.5164 12.8975 99.5913 83.7080 5.7406 8.0416 8.4742 3.0794 9.8713 1.0864 3.4324 4.8071 12.0827 6.3772 5.3462 5.3076 116.4409 5.0975 3.5292 6.9145 30.8876 11.8749 1.6303 0.1826 142.8817 150.7168 17.7525 59.6135 44.5177 3.4561 30.4653 50.6577 40.0392 9.4869 21.1677 10.6501 7.4258 5.8415 40.5938 15.6824 21.3855 14.6114 12.5732 11.6699 5.3917 25.1605 96.3324 371.2046 47.7598 32.5316 43.6538 30.4339 15.6204 11.6893 6.7670 5.7357 32.5647 18.5613 7.8747 13.8457 9.9871
temp: 298.150 k
press: 1.00000 atm
elementType: 8 8 8 8 7 6 6 6 6 6 6 6 6 1 1 1 1 1 1 1 1 1 1 1 1 1
symmnumber: 1
zpe: 549415.3 jmol-1
zpe.correction: 0.209261 hartree
zpe.thermalcorrener: 0.223425 hartree
zpe.thermalcorrenthalpy: 0.224369 hartree
zpe.thermalcorrgfe: 0.165811 hartree
zpe.sumelectzpe: -667.274915 hartree
zpe.sumelectthermal: -667.260752 hartree
zpe.sumelectthermalent: -667.259808 hartree
zpe.sumelectthermalfe: -667.318366 hartree
dipole: -3.2041 -0.5811 1.9351
dipole: 3.7880
quadrupole: -70.8845 -90.4558 -72.4111
quadrupole: 0.9465 -0.7107 1.1786
quadrupole: 7.0326 -12.5387 5.5060 0.9465 -0.7107 1.1786
hfenergy: -667.4841766 hartree
pointgroup: C01 [X(C8H13N1O4)]
dipole: -1.289632 -0.2310798 0.7102684 debye
dipolederiv: -0.627417 -0.3367079 0.166479 -0.0706873 -1.0173309 0.1697097 0.1784892 0.3327213 -0.4794755 -1.3174179 0.3171624 -0.2040074 0.453715 -0.5518729 -0.0087417 -0.2136849 -0.0591215 -0.40729 -0.6368941 -0.0280529 -0.1331993 0.2387627 -0.699442 -0.1684925 -0.0286368 -0.3576685 -0.5015669 -0.9764389 0.1425921 0.0405035 0.1012814 -0.2598967 -0.2036027 0.0684164 -0.2272661 -0.4676287 -0.7236277 0.2124121 0.0710047 0.1450347 -1.0132598 0.1270724 0.0633216 -0.0188018 -0.3661675 -0.1092382 -0.0152084 -0.0848944 -0.0310062 -0.0615956 -0.1048921 -0.1947912 -0.0915536 0.0067223 0.2590934 0.2171642 -0.0338317 0.1366619 0.2415295 -0.1611855 -0.0603684 -0.1555953 0.3465928 -0.2213481 0.0277976 0.1665311 0.1591793 0.0548544 0.0385539 0.2087069 0.015822 -0.0025571 0.7221359 0.0372514 -0.2940016 -0.1511035 1.6030052 -0.2599478 -0.349446 -0.3047811 0.3370983 0.3682844 -0.1227184 -0.0543334 -0.0893764 0.1651985 0.0413657 -0.1585054 0.1766209 0.2013387 1.4249629 -0.2753352 0.2919932 -0.6309942 0.886789 0.2547411 0.274299 0.4825262 0.5561592 0.6882566 -0.1094935 -0.1148082 -0.0511135 0.2872993 0.0595162 -0.1024317 0.031195 0.3341259 0.5913841 -0.0427007 0.1138272 0.0136811 0.2322076 -0.0226803 0.2078571 -0.0492307 0.3193586 -0.0245633 -0.0310451 0.0493671 -0.0222553 0.0869402 0.0282685 0.0760122 0.0337017 -0.0409021 -0.0326893 0.0050197 -0.0862058 -0.0103326 0.0189644 0.0621192 -0.0426311 0.140678 -0.1346362 0.1408888 -0.0398364 0.0273829 -0.0373344 -0.0559296 -0.0129471 0.0457619 -0.0813102 0.0421172 0.0384335 -0.0435393 -0.0453854 -0.0597643 0.0396575 -0.050371 -0.006236 -0.0910381 -0.0570802 0.0462364 0.0679114 -0.0123932 0.0575046 0.0429202 0.0507659 -0.046563 0.0648325 0.0738729 0.0019107 0.0090829 0.0379899 -0.0688818 0.0553097 0.1237299 0.0414192 0.0354603 -0.005292 0.0123515 -0.0276326 -0.0305902 -0.0032777 -0.0793887 -0.1083537 -0.0241372 -0.0759008 0.0468815 0.033549 -0.0209822 0.0519072 -0.0240585 -0.0044179 0.1153879 0.0445165 0.0791736 -0.0548878 -0.0116177 0.0006108 0.0052441 -0.010654 -0.1176511 -0.1389962 -0.0007906 -0.0801497 -0.0078758 0.3841911 0.0070236 0.0340505 -0.0049153 0.1052853 0.164201 0.0798039 0.1496702 0.2121941 -0.0228936 0.0841084 -0.0061093 0.1272667 0.0022725 -0.0283964 0.017527 -0.0472868 0.0939148 -0.006323 -0.0278351 -0.0253007 -0.1343213 -0.0617982 0.0328186 -0.0455979 0.0608292 0.0567076 -0.0012095 -0.0070489 0.0687801 -0.0330113 0.1003501 0.000357 -0.0323109 0.0364732 -0.1017243 unknown
polarizability: 123.1155123|-6.8072396|101.1517481|-2.6390449|0.0000551|83.0859568 unknown
InChI: InChI=1S/C8H13NO4/c1-13-8(12)6-4-7(11)9(5-6)2-3-10/h6,10H,2-5H2,1H3
charge 0 multiplicity 1
26 atoms
O  1.368831 2.125693 -0.467857
O  -3.21181 0.342874 0.117551
O  -2.126716 -1.51876 -0.757533
O  4.717673 -1.259537 -0.338503
N  1.111269 -0.155585 0.069885
C  -1.059759 -0.178913 1.050663
C  0.217282 -1.042228 0.840625
C  -0.565833 1.291225 0.897405
C  0.733987 1.182761 0.085502
C  2.32671 -0.621668 -0.602186
C  -2.143827 -0.54785 0.032149
C  3.536266 -0.73686 0.358663
C  -4.349974 0.079545 -0.799266
H  -1.498877 -0.343669 2.050734
H  0.668648 -1.327511 1.811851
H  -0.011116 -1.959577 0.269545
H  -0.33629 1.744914 1.878941
H  -1.291887 1.945699 0.392785
H  2.558431 0.113948 -1.39597
H  2.140331 -1.603622 -1.074767
H  3.33933 -1.474603 1.154645
H  3.737819 0.249102 0.825227
H  5.032655 -0.58604 -0.992938
H  -5.078507 0.870416 -0.574229
H  -4.771603 -0.92058 -0.604212
H  -4.012735 0.133727 -1.847612
