program: Gaussian 09
title: 000232922
version: EM64L-G09RevD.01
frameworkgroup: C1[X(C18H16N2O)]
method: RPBEPBE
basis: SDD
operation: Freq
keyword: #p
keyword: freq=noraman
keyword: PBEPBE/SDD
title: #p freq=noraman PBEPBE/SDD
converged: YES YES NO NO
title: Mulliken charges:
elementType: O N N C C C C C C C C C C C C C C C C C C H H H H H H H H H H H H H H H H
charge: -0.271616 -0.153306 -0.422022 0.185236 -0.481649 -0.065759 0.169944 -0.382807 0.164050 0.251218 -0.565005 -0.410583 -0.365421 0.509230 -0.249204 -0.216264 -0.425928 -0.392945 -0.223930 -0.230029 -0.242404 0.240593 0.245402 0.266809 0.223262 0.323637 0.239672 0.206963 0.235379 0.237377 0.223890 0.224849 0.228994 0.245760 0.223323 0.225459 0.227825
chargesum: 0.00000
title: Mulliken charges with hydrogens summed into heavy atoms:
elementType: O N N C C C C C C C C C C C C C C C C C C
charge: -0.271616 -0.153306 -0.098386 0.185236 0.004346 -0.065759 0.169944 0.107264 0.164050 0.251218 -0.118369 -0.175203 -0.128045 0.509230 -0.025314 0.008586 -0.196934 -0.147185 -0.000607 -0.004571 -0.014579
polarizability: 3.40380061e+02 -1.60570693e+01 2.11410760e+02 -2.07125857e+01 -6.30342237e+00 9.75729832e+01
1716.lowfreq: -4.6366 -0.0007 -0.0006 0.0005 3.9880 5.4295 20.3889 24.6255 27.2801
frequency: 19.9619 23.1447 27.0866 49.7713 83.4492 103.1334 122.5388 174.8272 201.7718 244.9844 266.4500 274.3413 300.0777 318.9877 340.2185 358.8089 404.8904 430.6776 452.0816 501.0676 548.2438 554.5392 572.0971 572.3982 603.0836 616.9209 622.0262 646.4774 664.9104 706.2018 725.2632 752.7139 756.5526 757.4636 777.0006 789.0745 798.0620 824.6956 852.9656 855.9401 887.9458 918.3610 935.1945 969.8366 974.2011 977.7201 978.8895 989.8188 993.8242 1007.2546 1011.5597 1013.5926 1026.4878 1070.8927 1097.2156 1116.2452 1135.5169 1141.5655 1169.2470 1172.0782 1187.6680 1203.2263 1217.5907 1227.4053 1240.8831 1255.3476 1291.1642 1306.4198 1321.0396 1329.2190 1363.7302 1367.9186 1382.1569 1391.0069 1400.7682 1440.8117 1452.3862 1457.8752 1464.7979 1478.9745 1481.5122 1483.7640 1494.5162 1552.0297 1581.4955 1592.7529 1613.7283 1632.1807 1642.8318 2961.4031 2991.0460 2998.9340 3001.4846 3046.9444 3073.3407 3113.0876 3117.4035 3127.8592 3131.5691 3135.7409 3143.5719 3149.0913 3162.1254 3165.7786 3608.9377
redmass: 4.6456 4.0783 5.4527 3.3419 5.1010 6.7456 5.7319 4.0659 3.0508 4.1675 5.6044 2.8298 3.5453 4.2974 4.0281 3.3966 2.8283 2.9589 5.6601 3.2044 5.5499 1.3334 2.8697 5.2674 4.5152 6.2729 5.1417 5.5828 6.0105 1.7610 7.1760 1.3221 2.0012 3.5874 1.8424 3.4393 3.1060 3.8292 1.4543 1.2474 4.4940 1.5367 1.3772 3.5831 1.3267 1.3959 1.7549 6.2361 1.3528 2.4275 2.2505 3.4667 2.2039 1.9166 3.0881 1.6117 1.8350 1.0944 1.1187 1.0532 1.1181 1.6552 2.3382 1.4592 1.9349 2.4072 1.3996 1.6315 2.0701 1.2587 1.5683 1.5882 7.6819 3.6189 2.4850 2.1686 1.1313 4.6437 1.1506 1.2073 3.6449 2.1211 3.5764 8.1228 6.2692 6.0389 6.1299 7.6136 10.9868 1.0576 1.0597 1.0654 1.0987 1.1005 1.1051 1.0871 1.0871 1.0850 1.0908 1.0892 1.0958 1.0955 1.1014 1.1002 1.0809
irintensity: 0.1639 0.2488 0.2310 0.1370 0.0258 0.1477 3.8372 3.9658 1.6591 0.7378 0.8627 9.1433 5.1140 7.4633 4.0927 0.7649 0.0141 12.4971 17.0657 22.0845 0.7736 86.5132 12.3302 2.2422 0.2670 0.1179 0.9025 2.0099 2.2001 52.6836 24.1164 99.0445 40.8558 3.2751 8.0363 4.3833 1.5178 7.9700 0.0404 0.0337 0.7313 1.9991 2.7677 9.4028 0.1349 0.1623 0.7672 0.2487 0.2920 13.8771 13.0385 6.6788 10.2349 0.4965 25.4225 31.5659 14.0499 0.9621 1.9433 0.1443 0.1797 36.1119 1.2874 36.6582 2.0234 97.7007 0.8668 145.0890 25.4330 1.6270 37.4714 75.6345 0.0349 26.1849 7.6000 6.5227 15.0105 12.0651 7.0364 11.2227 21.3330 13.1117 0.5283 20.2692 0.3126 2.4176 11.5603 1.9707 391.8902 34.6065 6.4390 47.3445 35.0202 4.5595 13.2689 10.3760 5.7420 0.6739 10.9825 2.5715 40.8532 29.8770 28.8136 32.6386 78.7897
temp: 298.150 k
press: 1.00000 atm
elementType: 8 7 7 6 6 6 6 6 6 6 6 6 6 6 6 6 6 6 6 6 6 1 1 1 1 1 1 1 1 1 1 1 1 1 1 1 1
symmnumber: 1
zpe: 777966.6 jmol-1
zpe.correction: 0.296312 hartree
zpe.thermalcorrener: 0.313339 hartree
zpe.thermalcorrenthalpy: 0.314283 hartree
zpe.thermalcorrgfe: 0.248698 hartree
zpe.sumelectzpe: -878.804912 hartree
zpe.sumelectthermal: -878.787885 hartree
zpe.sumelectthermalent: -878.786941 hartree
zpe.sumelectthermalfe: -878.852526 hartree
dipole: 1.2794 -2.5402 0.0762
dipole: 2.8452
quadrupole: -105.5655 -115.4680 -128.5114
quadrupole: 7.0640 -4.0606 -3.3561
quadrupole: 10.9495 1.0470 -11.9965 7.0640 -4.0606 -3.3561
hfenergy: -879.1012242 hartree
pointgroup: C01 [X(C18H16N2O1)]
dipole: 0.5035354 -0.9981174 0.0567592 debye
polarizability: 340.2721345|-16.6539027|210.9651339|-20.8946404|-9.4504736|98.1265361 unknown
InChI: InChI=1S/C18H16N2O/c21-18-17-15(14-8-4-5-9-16(14)19-17)12-20(18)11-10-13-6-2-1-3-7-13/h1-9,19H,10-12H2
charge 0 multiplicity 1
37 atoms
O  -0.152803 2.502273 0.135343
N  -0.247723 0.147135 0.512822
N  3.027111 1.606592 -0.179981
C  2.003176 -0.391567 0.253248
C  0.663197 -1.029941 0.537079
C  1.81912 0.97649 0.085979
C  3.407035 -0.666265 0.089024
C  -1.696771 0.06116 0.69017
C  0.404579 1.367046 0.229425
C  4.029265 0.619777 -0.184448
C  -2.459009 -0.277334 -0.628579
C  4.224694 -1.827883 0.136332
C  5.41821 0.746625 -0.402987
C  -3.963039 -0.296142 -0.407865
C  5.608541 -1.697896 -0.082221
C  6.198393 -0.425688 -0.348619
C  -4.665677 -1.515545 -0.231065
C  -4.689304 0.921554 -0.326991
C  -6.057669 -1.521968 0.017476
C  -6.079766 0.920015 -0.079156
C  -6.76966 -0.303012 0.09509
H  0.36788 -1.773216 -0.231252
H  0.619825 -1.529792 1.525858
H  -2.04085 1.044731 1.058023
H  -1.930933 -0.694515 1.464136
H  3.156213 2.603443 -0.340379
H  -2.184104 0.489176 -1.376585
H  -2.112365 -1.256726 -1.00998
H  3.785034 -2.810364 0.340242
H  5.878613 1.719287 -0.607877
H  6.249325 -2.58575 -0.048112
H  7.279411 -0.360305 -0.51398
H  -4.120428 -2.465907 -0.296346
H  -4.160738 1.872917 -0.467771
H  -6.585525 -2.473932 0.146138
H  -6.625369 1.869011 -0.02523
H  -7.848888 -0.305486 0.285032
