program: Gaussian 09
title: 000232958
version: EM64L-G09RevD.01
frameworkgroup: C1[X(C20H20N2O4)]
method: RPBEPBE
basis: SDD
operation: Freq
keyword: #p
keyword: freq=noraman
keyword: PBEPBE/SDD
title: #p freq=noraman PBEPBE/SDD
converged: YES YES NO NO
title: Mulliken charges:
elementType: O O O O N N C C C C C C C C C C C C C C C C C C C C H H H H H H H H H H H H H H H H H H H H
charge: -0.257031 -0.307453 -0.288148 -0.308403 -0.098286 -0.123624 0.271345 0.239968 -0.047081 0.160971 -0.386829 -0.387890 -0.320696 -0.361882 -0.234728 -0.231120 0.234522 0.044932 0.293741 0.315898 -0.461375 -0.550507 -0.532121 -0.523718 -0.524701 -0.526619 0.276565 0.271490 0.273660 0.241605 0.228207 0.228406 0.288698 0.272154 0.227397 0.227256 0.247051 0.234458 0.227561 0.258105 0.229566 0.260308 0.214740 0.249211 0.224150 0.230246
chargesum: 0.00000
title: Mulliken charges with hydrogens summed into heavy atoms:
elementType: O O O O N N C C C C C C C C C C C C C C C C C C C C
charge: -0.257031 -0.307453 -0.288148 -0.308403 -0.098286 -0.123624 0.271345 0.239968 -0.047081 0.160971 -0.110264 -0.116400 -0.047037 -0.120277 -0.006521 -0.002714 0.234522 0.044932 0.293741 0.315898 -0.172678 -0.278353 0.169583 0.196406 0.179913 0.176989
polarizability: 5.84943810e+02 1.17977206e+00 2.91872455e+02 1.47430634e+00 -1.69088636e+00 1.21593538e+02
1716.lowfreq: -7.9354 -1.7241 -0.0004 0.0005 0.0006 3.8660 11.6686 29.4093 38.1024
frequency: 9.0234 29.3657 38.0334 60.1363 63.8390 80.5739 87.7595 94.0707 102.5644 130.5851 137.0613 140.7707 153.2185 157.4928 160.4545 177.2020 179.5756 205.3181 216.0325 226.7272 241.0318 246.5571 267.3279 301.8347 320.5028 325.5766 362.7283 388.8804 397.5415 420.7667 432.0910 457.9681 477.1069 477.7972 487.0832 522.1017 551.7920 586.9114 609.8261 614.1775 635.7546 649.6743 656.1471 672.9055 696.9619 723.4826 769.4334 779.3289 785.3808 813.8649 833.5104 836.0534 866.9389 893.9546 900.5129 912.2484 921.7012 937.9754 940.9657 970.5002 983.1281 1000.5128 1006.4782 1017.9966 1032.6287 1039.1877 1073.2853 1097.5170 1109.2282 1111.4732 1112.0415 1114.3344 1144.7739 1145.6436 1150.4411 1154.2210 1158.0726 1169.2482 1174.2214 1185.6609 1187.6430 1215.1930 1242.4476 1268.7058 1293.5199 1334.9194 1356.6558 1373.5180 1382.1760 1402.3194 1411.5130 1423.8961 1432.7853 1433.3719 1435.6588 1438.6954 1446.6493 1455.2939 1457.2300 1458.4095 1460.8265 1468.4360 1472.5182 1476.5798 1483.0879 1485.4207 1517.7562 1556.2019 1568.5543 1582.0191 1592.2909 1627.7034 2968.9161 2972.1893 2973.5551 2981.3882 3061.1665 3069.5267 3079.5005 3083.3339 3120.4253 3124.6067 3124.9789 3129.9514 3131.1124 3149.1960 3151.5958 3170.0288 3173.5064 3177.9857 3178.7111 3183.9296
redmass: 4.6813 4.7278 5.1466 3.4875 2.6013 3.0842 3.2788 2.9094 3.5776 2.0772 3.3691 2.6799 2.1370 1.1581 1.4129 3.5442 4.4294 3.2030 4.5896 1.6218 3.3583 3.4652 5.1810 6.5013 4.1547 4.6444 5.2599 5.3414 6.9204 4.0054 4.9445 6.3323 5.5982 4.0906 5.9388 6.2829 7.0957 5.1180 4.4403 3.3450 5.8350 3.6023 4.9130 3.7197 5.7263 5.7219 4.4420 5.6655 1.3554 3.1205 2.6532 2.1248 5.9688 1.5356 1.6656 1.6920 6.6242 9.1154 7.0649 1.3922 1.3642 3.9846 1.3319 3.1152 3.3838 3.3882 3.6276 2.8360 1.2426 1.2559 1.2599 1.2478 1.4738 1.3807 1.4300 1.4830 1.4585 1.2719 2.1697 1.4036 1.4472 2.1856 3.2193 1.9193 5.5742 9.5923 6.7213 6.1464 2.2214 2.2483 1.5587 8.7795 1.5767 1.4236 1.6072 1.7728 1.6886 2.0032 1.0649 1.1112 1.1446 1.0527 1.0853 1.0562 1.0549 1.0540 4.2236 8.0883 6.1403 7.2608 7.2177 6.9015 1.0324 1.0311 1.0332 1.0294 1.1043 1.1038 1.0994 1.1054 1.1027 1.1037 1.1040 1.0864 1.1002 1.0917 1.0872 1.0950 1.0940 1.0923 1.0976 1.0911
irintensity: 0.1520 2.2883 1.9793 1.1272 4.2167 2.2578 5.9027 8.4817 1.3154 0.0911 6.6754 1.3328 1.3048 1.0031 1.0225 4.5012 1.7547 4.2942 2.7519 0.9993 3.8504 13.6375 9.1704 3.9037 6.4163 2.8160 10.8497 0.7146 17.6823 10.9647 10.7121 29.3229 7.0630 2.8096 5.4531 1.1879 23.7145 27.0005 5.0426 5.5981 2.1971 0.3916 7.5327 6.5404 13.1906 7.1710 10.0759 0.6943 99.2627 0.4475 7.0559 31.5328 6.5698 7.8699 0.2185 34.4688 51.4826 102.0312 16.9841 1.7469 2.8426 123.1345 0.3127 17.0372 108.7652 67.1839 136.8743 20.7965 30.3399 6.7654 0.0692 4.1196 6.5055 7.4022 0.7775 5.8684 15.8288 12.5097 45.1206 0.3718 25.0329 7.3292 386.7613 77.4182 564.3445 58.5753 12.7528 15.5853 16.6167 38.3861 69.2863 40.0703 2.2811 68.4057 6.2525 68.7904 85.8593 67.1261 27.1322 7.8852 14.9263 15.1607 44.7243 3.1910 14.9862 44.3935 109.1417 83.6880 5.3269 244.2375 4.8460 6.3931 103.9290 58.7008 119.0254 90.5514 40.2210 26.9130 32.9698 20.2079 28.6739 25.7198 20.5023 6.3156 26.3379 21.5202 7.5024 17.5978 5.9490 0.6585 23.3110 4.6946
temp: 298.150 k
press: 1.00000 atm
elementType: 8 8 8 8 7 7 6 6 6 6 6 6 6 6 6 6 6 6 6 6 6 6 6 6 6 6 1 1 1 1 1 1 1 1 1 1 1 1 1 1 1 1 1 1 1 1
symmnumber: 1
zpe: 938257.5 jmol-1
zpe.correction: 0.357363 hartree
zpe.thermalcorrener: 0.382600 hartree
zpe.thermalcorrenthalpy: 0.383544 hartree
zpe.thermalcorrgfe: 0.300370 hartree
zpe.sumelectzpe: -1182.552750 hartree
zpe.sumelectthermal: -1182.527514 hartree
zpe.sumelectthermalent: -1182.526569 hartree
zpe.sumelectthermalfe: -1182.609743 hartree
dipole: 0.1752 -1.9899 -1.0798
dipole: 2.2708
quadrupole: -101.4158 -134.6003 -152.7775
quadrupole: 13.3350 -4.4451 -1.1772
quadrupole: 28.1821 -5.0024 -23.1796 13.3350 -4.4451 -1.1772
hfenergy: -1182.9101137 hartree
pointgroup: C01 [X(C20H20N2O4)]
dipole: -0.0872536 -0.7330241 0.5032002 debye
polarizability: 582.70182|5.8227558|290.2818502|31.6259665|-16.4580944|125.4261332 unknown
InChI: InChI=1S/C20H20N2O4/c1-23-17-10-9-16(14-7-5-6-8-15(14)17)22-21-13-11-18(24-2)20(26-4)19(12-13)25-3/h5-12H,1-4H3
charge 0 multiplicity 1
46 atoms
O  6.218243 -1.041786 0.437197
O  -5.682518 0.231749 -0.610382
O  -3.755217 2.359503 -0.817264
O  -4.733653 -2.429646 0.004963
N  0.68539 0.106856 0.017512
N  -0.162566 -0.89402 0.074072
C  3.014571 0.831506 0.128688
C  4.425218 0.534021 0.233351
C  2.055191 -0.258064 0.134862
C  4.839143 -0.844789 0.341056
C  2.61049 2.201438 0.023764
C  5.378467 1.602144 0.229625
C  2.513082 -1.58643 0.242182
C  3.892255 -1.885293 0.344218
C  3.558977 3.228205 0.022652
C  4.952668 2.928658 0.126113
C  -1.534006 -0.51973 -0.074361
C  -4.311421 -0.025701 -0.390217
C  -3.37284 1.050562 -0.472561
C  -3.839379 -1.335461 -0.084756
C  -1.997469 0.802214 -0.318577
C  -2.463078 -1.584832 0.053891
C  6.713176 -2.417411 0.556195
C  -6.236627 -0.422847 -1.824361
C  -4.80074 2.995745 0.014468
C  -5.701837 -2.346006 1.122906
H  1.541391 2.413954 -0.055389
H  6.440288 1.354573 0.309624
H  1.768699 -2.388604 0.241429
H  4.207178 -2.929645 0.42271
H  3.233934 4.271448 -0.059055
H  5.686223 3.742286 0.123689
H  -1.284668 1.625282 -0.40958
H  -2.106474 -2.596973 0.262478
H  6.440409 -3.017153 -0.332807
H  6.322953 -2.903053 1.470677
H  7.80662 -2.322558 0.621257
H  -5.727526 -0.032782 -2.724332
H  -7.302428 -0.148977 -1.842527
H  -6.115835 -1.51856 -1.760931
H  -4.951143 3.990992 -0.430797
H  -5.735196 2.411377 -0.011747
H  -4.443419 3.101838 1.05707
H  -6.32117 -1.434389 1.043798
H  -5.165033 -2.354831 2.090431
H  -6.328328 -3.246609 1.034264
