program: Gaussian 09
title: 000232911
version: EM64L-G09RevD.01
frameworkgroup: C1[X(C11H13NO3)]
method: RPBEPBE
basis: SDD
operation: Freq
keyword: #p
keyword: freq=noraman
keyword: PBEPBE/SDD
title: #p freq=noraman PBEPBE/SDD
converged: YES YES NO NO
title: Mulliken charges:
elementType: O O O N C C C C C C C C C C C H H H H H H H H H H H H H
charge: -0.414854 -0.232389 -0.258128 -0.438132 -0.566301 0.511773 -0.483236 -0.398068 -0.406855 0.476483 -0.448118 -0.354186 0.187725 0.210716 -0.800058 0.230952 0.232944 0.267224 0.264062 0.234744 0.234451 0.215645 0.307999 0.307301 0.237057 0.269450 0.235574 0.376224
chargesum: 0.00000
title: Mulliken charges with hydrogens summed into heavy atoms:
elementType: O O O N C C C C C C C C C C C
charge: -0.038630 -0.232389 -0.258128 -0.130831 -0.102405 0.511773 0.048050 -0.163324 -0.172405 0.476483 -0.232473 -0.046187 0.187725 0.210716 -0.057976
polarizability: 2.13564782e+02 -4.59653571e+00 1.20525202e+02 1.19511061e+01 6.59997370e+00 8.68765641e+01
1716.lowfreq: -79.2932 -6.9835 -3.2507 0.0007 0.0009 0.0010 7.8996 12.0658 22.6603
frequency: -79.2718 11.4893 22.2946 38.3001 68.5693 72.8721 94.8301 146.6616 172.2532 200.2352 287.4294 315.4481 365.3438 371.8917 408.5741 445.0132 500.6354 503.4048 540.5827 574.2286 583.6104 629.8261 637.7049 640.2722 645.1375 733.7009 776.2585 782.7783 824.5765 832.4992 855.7202 891.7306 928.9850 946.5258 985.6309 991.3413 1002.7478 1008.9437 1019.9263 1030.2473 1077.7125 1119.8782 1153.7991 1190.6441 1217.1501 1220.9312 1239.3367 1263.0013 1268.3438 1302.7129 1315.5572 1367.1629 1374.5104 1377.1336 1408.9808 1439.1607 1448.2327 1468.5363 1476.3007 1498.8386 1511.8578 1593.5852 1626.4918 1634.0487 1666.6583 2986.7339 2998.9396 3010.1996 3044.0679 3071.7647 3072.5906 3104.4308 3121.9359 3133.7453 3136.2521 3193.6878 3510.2584 3521.1597
redmass: 1.0535 7.0715 5.6800 5.1205 4.4470 2.3739 4.3120 4.5448 5.9849 5.1608 3.7083 4.3716 4.5967 3.5019 2.9528 4.2723 4.1614 1.7596 2.6990 4.5709 2.9841 5.8897 1.3326 1.1761 5.2448 3.6517 1.6426 2.9252 1.5516 4.9482 1.5361 2.7638 6.4346 1.4002 1.6688 1.3393 1.8548 2.7794 3.4704 1.6593 2.4828 1.3775 1.1626 1.1233 3.6003 2.1627 1.4394 1.9827 1.1845 1.7393 1.4545 1.8404 1.7495 2.0460 3.5362 1.0827 1.1315 1.0469 1.0981 1.9199 2.9005 5.4165 5.9285 5.4261 8.2422 1.0384 1.0615 1.0601 1.0987 1.0984 1.1028 1.0875 1.0910 1.0961 1.0978 1.0944 1.0639 1.0763
irintensity: 0.0195 2.3481 0.7608 0.5130 7.2823 1.1818 0.8253 3.4891 6.1798 0.9958 2.1500 1.2273 10.3987 1.8093 0.0162 9.7947 10.8149 28.3076 38.0054 38.2915 4.1629 1.3100 127.7588 63.5059 2.2832 0.7804 6.2999 2.4464 48.9339 1.2151 16.8701 16.2954 8.8202 1.2721 19.3817 6.2411 2.6275 4.6054 214.2109 8.7623 99.6011 10.5965 6.7859 1.4704 36.2663 10.8972 0.6136 43.8347 1.1968 56.8182 46.6296 85.7059 25.4737 130.4672 43.3734 29.4769 48.1826 19.7381 13.8713 86.9966 335.8899 41.4128 39.9114 122.1888 226.6579 9.5929 6.5314 22.1999 0.0642 15.9683 17.5390 21.3131 20.8217 14.7996 7.6201 5.2573 17.8130 11.4125
temp: 298.150 k
press: 1.00000 atm
elementType: 8 8 8 7 6 6 6 6 6 6 6 6 6 6 6 1 1 1 1 1 1 1 1 1 1 1 1 1
symmnumber: 1
zpe: 580515.1 jmol-1
zpe.correction: 0.221107 hartree
zpe.thermalcorrener: 0.235486 hartree
zpe.thermalcorrenthalpy: 0.236430 hartree
zpe.thermalcorrgfe: 0.175966 hartree
zpe.sumelectzpe: -706.317749 hartree
zpe.sumelectthermal: -706.303369 hartree
zpe.sumelectthermalent: -706.302425 hartree
zpe.sumelectthermalfe: -706.362889 hartree
dipole: 1.1968 3.3862 2.2203
dipole: 4.2224
quadrupole: -77.9397 -85.6734 -93.5744
quadrupole: 17.9037 -2.6362 2.9024
quadrupole: 7.7895 0.0558 -7.8452 17.9037 -2.6362 2.9024
hfenergy: -706.5388552 hartree
pointgroup: C01 [X(C11H13N1O3)]
dipole: 0.4689776 1.3609001 0.8292455 debye
polarizability: 213.5805888|-4.0639706|120.9098071|12.068558|5.5002277|86.4761516 unknown
InChI: InChI=1S/C11H13NO3/c1-8(13)12-10-5-2-9(3-6-10)4-7-11(14)15/h2-3,5-6,12,14H,4,7H2,1H3
charge 0 multiplicity 1
28 atoms
O  -5.303518 -0.578971 1.487176
O  -5.278871 -0.011824 -0.764215
O  4.111142 -1.631926 -0.049024
N  3.316889 0.559543 0.246703
C  -2.383346 0.202537 -0.797783
C  -0.88393 0.285222 -0.555476
C  -3.149566 -0.147877 0.501539
C  -0.266928 1.510633 -0.195967
C  -0.060472 -0.865322 -0.644835
C  1.925155 0.417039 -0.026602
C  1.115121 1.580908 0.064916
C  1.325578 -0.819151 -0.387674
C  -4.649305 -0.224811 0.295023
C  4.319443 -0.415064 0.228829
C  5.707218 0.127083 0.577787
H  -2.769082 1.160673 -1.191011
H  -2.612527 -0.561922 -1.562276
H  -2.805411 -1.114482 0.91604
H  -2.948572 0.600422 1.292344
H  -0.872769 2.422605 -0.12809
H  -0.509232 -1.82484 -0.931569
H  1.569167 2.543763 0.334988
H  1.948097 -1.712032 -0.464595
H  3.617515 1.507015 0.489025
H  6.03181 0.897479 -0.146292
H  6.423939 -0.705894 0.550669
H  5.723007 0.575958 1.588446
H  -6.284653 -0.620465 1.320724
