program: Gaussian 09
title: 000232912
version: EM64L-G09RevD.01
frameworkgroup: C1[X(C12H14N2O4)]
method: RPBEPBE
basis: SDD
operation: Freq
keyword: #p
keyword: freq=noraman
keyword: PBEPBE/SDD
title: #p freq=noraman PBEPBE/SDD
converged: YES YES NO NO
title: Mulliken charges:
elementType: O O O O N N C C C C C C C C C C C C H H H H H H H H H H H H H H
charge: -0.264106 -0.239563 -0.200672 -0.200791 -0.298404 0.084418 -0.568956 0.512313 -0.499300 -0.403943 -0.400030 0.477240 -0.348583 -0.329106 0.252627 0.223676 -0.746586 -0.504982 0.227690 0.244123 0.259736 0.259787 0.241764 0.240233 0.249472 0.254454 0.247000 0.254403 0.256096 0.241903 0.235208 0.242880
chargesum: 0.00000
title: Mulliken charges with hydrogens summed into heavy atoms:
elementType: O O O O N N C C C C C C C C C C C C
charge: -0.264106 -0.239563 -0.200672 -0.200791 -0.298404 0.084418 -0.097144 0.512313 0.020223 -0.162179 -0.159798 0.477240 -0.099110 -0.074652 0.252627 0.223676 0.010913 0.215008
polarizability: 2.32428150e+02 -8.02170671e+00 1.43474573e+02 7.12659548e+00 7.29920492e+00 1.15230243e+02
1716.lowfreq: -14.9380 -3.5465 -1.3898 -0.0007 -0.0006 0.0004 5.2395 13.9867 30.4666
frequency: 4.6087 13.0135 30.4555 45.2446 52.0172 67.6967 87.2353 90.9621 133.9234 142.2685 147.9058 180.1260 190.5984 228.6152 246.8685 273.0314 315.3578 337.2444 358.8003 403.5293 413.0796 440.0936 460.5951 504.6677 534.1006 566.1370 591.0250 618.6811 635.4072 650.9251 696.9961 736.2742 777.0884 798.8395 817.6936 836.2223 866.4939 873.5710 942.8543 956.5171 969.1615 979.7969 1002.6431 1009.3801 1032.4074 1035.6220 1049.1610 1112.8164 1114.4009 1133.2402 1148.1076 1160.4719 1170.8149 1195.0575 1220.9765 1264.4306 1283.8686 1286.8958 1314.6201 1351.5119 1382.3554 1387.5602 1397.6348 1413.6415 1422.4388 1442.8953 1445.2885 1452.9021 1455.1152 1464.0112 1478.8115 1497.9675 1584.3827 1616.1283 1636.1722 1644.2274 2994.4927 3005.1954 3010.0969 3013.8032 3054.1871 3077.9203 3103.3119 3107.1598 3129.1746 3131.8136 3139.0888 3150.5361 3169.2030 3174.2072
redmass: 6.0486 4.8343 5.8212 3.0894 3.1942 4.0571 2.5660 1.4062 6.2772 3.8277 1.1214 4.4077 4.9771 6.4488 7.2223 4.5142 3.7003 3.6820 4.1863 2.8565 4.6945 11.4829 4.9606 4.7685 3.0444 2.8624 3.3372 4.3086 6.2106 5.7783 4.9800 3.9979 1.4394 4.0282 2.0806 1.2617 4.4318 3.3798 2.5779 2.4570 1.3912 3.6261 1.9103 3.0712 2.0511 1.6944 4.3125 1.2690 1.5304 1.8725 1.4452 1.4309 2.5660 1.2357 2.3984 1.2176 1.9828 3.2283 1.2972 1.6130 5.7115 1.2292 8.7969 3.3992 1.1898 1.0822 1.0715 1.0501 1.0473 1.0508 1.1026 2.5783 7.1145 6.4386 9.1774 9.0304 1.0640 1.0298 1.0607 1.0363 1.0970 1.1014 1.0968 1.1046 1.0898 1.0900 1.1020 1.1048 1.0954 1.0959
irintensity: 1.1354 0.4194 0.2591 0.1124 0.1437 5.4739 0.7363 0.9817 1.5039 1.7665 0.8499 7.1829 3.4267 12.3043 3.7988 23.1991 4.3118 0.6723 1.4527 0.4696 1.0888 13.6017 2.7841 15.3025 14.7582 6.3884 0.4335 55.7680 0.5822 30.8464 47.6613 2.0035 13.3090 22.7768 23.5217 2.2790 80.1923 105.5365 3.8361 13.2252 0.4041 19.9696 9.0147 1.5156 9.9988 7.0364 41.7327 0.2692 63.2676 143.8918 10.8662 92.5232 83.0048 12.1800 2.6541 18.5158 218.9428 40.6186 4.4278 30.1992 7.6348 54.6166 183.8091 23.9065 23.8945 20.9851 18.4268 14.4376 19.3673 12.2170 14.8190 38.7284 0.5277 21.7426 91.6898 178.6730 4.8341 34.0113 19.7472 0.6296 0.5709 15.4827 4.9063 26.4334 11.0250 16.4187 12.7270 15.6828 6.1115 1.6774
temp: 298.150 k
press: 1.00000 atm
elementType: 8 8 8 8 7 7 6 6 6 6 6 6 6 6 6 6 6 6 1 1 1 1 1 1 1 1 1 1 1 1 1 1
symmnumber: 1
zpe: 639307.5 jmol-1
zpe.correction: 0.243499 hartree
zpe.thermalcorrener: 0.262382 hartree
zpe.thermalcorrenthalpy: 0.263327 hartree
zpe.thermalcorrgfe: 0.190824 hartree
zpe.sumelectzpe: -874.682487 hartree
zpe.sumelectthermal: -874.663604 hartree
zpe.sumelectthermalent: -874.662660 hartree
zpe.sumelectthermalfe: -874.735162 hartree
dipole: 1.0443 0.6850 -1.3168
dipole: 1.8148
quadrupole: -85.1578 -117.5802 -102.0357
quadrupole: 3.4698 -7.0108 7.6481
quadrupole: 16.4334 -15.9890 -0.4444 3.4698 -7.0108 7.6481
hfenergy: -874.9259865 hartree
pointgroup: C01 [X(C12H14N2O4)]
dipole: -0.4086374 -0.1762214 -0.5583591 debye
polarizability: 232.5905504|-5.3323307|144.983039|-8.5053507|-1.858581|113.559376 unknown
InChI: InChI=1S/C12H14N2O4/c1-9(15)14(13-17)11-6-3-10(4-7-11)5-8-12(16)18-2/h3-4,6-7H,5,8H2,1-2H3
charge 0 multiplicity 1
32 atoms
O  -5.400582 -0.511177 -1.067492
O  -5.196183 0.339608 1.091309
O  3.992909 1.952345 0.248731
O  3.000467 -2.462127 -0.664476
N  3.33348 -0.251539 -0.159866
N  3.861373 -1.542519 -0.557252
C  -2.328159 0.677972 0.730241
C  -0.839112 0.45826 0.519654
C  -3.172185 -0.189689 -0.239175
C  -0.150854 -0.566593 1.218686
C  -0.108538 1.248664 -0.404692
C  1.928632 -0.002965 0.076221
C  1.222059 -0.802555 1.005335
C  1.263057 1.023343 -0.634299
C  -4.662983 -0.071697 0.035405
C  4.334792 0.787524 -0.06678
C  5.766226 0.380727 -0.363301
C  -6.876017 -0.49219 -0.903278
H  -2.587204 1.741422 0.575183
H  -2.620773 0.43061 1.766168
H  -2.977062 0.071438 -1.294306
H  -2.89205 -1.256712 -0.133107
H  -0.694174 -1.18159 1.945961
H  -0.617067 2.055781 -0.945169
H  1.739566 -1.588807 1.562111
H  1.817558 1.648204 -1.339784
H  6.400217 1.270263 -0.232917
H  5.868924 -0.005236 -1.391387
H  6.10414 -0.423235 0.311578
H  -7.17526 -1.14347 -0.064931
H  -7.268573 -0.867951 -1.85824
H  -7.224526 0.535189 -0.704829
