program: Gaussian 09
title: 000232937
version: EM64L-G09RevD.01
frameworkgroup: C1[X(C19H15Cl2N5OS)]
method: RPBEPBE
basis: SDD
operation: Freq
keyword: #p
keyword: freq=noraman
keyword: PBEPBE/SDD
title: #p freq=noraman PBEPBE/SDD
converged: YES YES NO NO
title: Mulliken charges:
elementType: Cl Cl S O N N N N N C C C C C C C C C C C C C C C C C C C H H H H H H H H H H H H H H H
charge: 0.000064 0.008467 0.262364 -0.242815 -0.278903 -0.398072 -0.037831 -0.475110 -0.022884 -0.136820 0.078041 0.384858 -0.231427 0.438490 -0.498751 0.493120 -0.005581 -0.333737 -0.360933 -0.423336 -0.386638 -0.219413 -0.217088 -0.241490 -0.061563 -0.190595 -0.108882 -0.809812 0.352808 0.250123 0.227875 0.344736 0.280133 0.261126 0.267539 0.268309 0.232837 0.229911 0.231586 0.265023 0.281563 0.242528 0.280181
chargesum: 0.00000
title: Mulliken charges with hydrogens summed into heavy atoms:
elementType: Cl Cl S O N N N N N C C C C C C C C C C C C C C C C C C C
charge: 0.000064 0.008467 0.262364 -0.242815 -0.278903 -0.045265 -0.037831 -0.130374 -0.022884 -0.136820 0.078041 0.384858 -0.231427 0.438490 -0.020753 0.493120 -0.005581 -0.053604 -0.099807 -0.155797 -0.118328 0.013424 0.012823 -0.009904 -0.061563 0.074428 -0.108882 -0.005540
polarizability: 4.52729795e+02 7.28316502e+00 2.97139028e+02 2.59181980e+01 -1.91155258e+01 1.66318553e+02
1716.lowfreq: -4.1113 -0.7536 -0.0016 0.0011 0.0012 4.0288 9.5003 15.2274 20.4644
frequency: 9.4740 15.1301 20.4313 37.2031 46.4530 50.1897 67.0862 84.2281 87.5256 108.3835 128.1956 132.1605 139.8563 159.1048 163.5921 186.5888 192.0453 197.5870 219.3570 235.3725 248.3449 275.8054 324.5590 333.2620 353.8761 358.8368 381.8783 406.3488 408.9558 434.8203 442.5410 446.2797 482.1193 512.9032 533.1060 549.0061 571.3651 580.2818 611.3114 619.2297 633.8955 642.8719 653.1165 660.6856 667.5216 680.9836 693.7851 705.0638 710.9767 722.7741 741.0124 751.9435 772.8643 804.9794 827.9375 838.0088 855.0197 881.5299 915.1774 920.5202 953.7446 963.8206 970.2000 982.0146 989.3765 993.8705 994.2343 998.1998 1008.1732 1025.6009 1042.9602 1071.6721 1087.8895 1119.8609 1131.1875 1146.1413 1174.8188 1188.4912 1193.1156 1210.8653 1226.6368 1244.3953 1258.8347 1297.7400 1311.9053 1326.7411 1337.3360 1339.4725 1361.4578 1375.7255 1383.3884 1394.4430 1411.3537 1433.6281 1445.1359 1451.4431 1459.9163 1462.4397 1483.5463 1488.2455 1499.5049 1570.4854 1575.5277 1597.3183 1599.7399 1611.7574 1639.6094 1669.0736 2951.8613 2995.5187 3026.4382 3132.1482 3143.1213 3148.1714 3152.0439 3153.8446 3155.4272 3159.0147 3167.9603 3173.7533 3188.3166 3530.4264 3533.7323
redmass: 6.8950 9.5600 9.3860 6.7283 4.1593 3.6878 6.2543 6.3208 5.6049 4.4424 1.3076 4.6832 7.9157 6.0935 5.7289 8.0391 5.8882 6.0779 6.0543 4.8567 5.4350 4.8105 8.6457 6.8872 9.4742 7.9393 7.3712 3.7041 4.9385 3.9498 6.2831 4.9323 5.0990 4.2884 9.1344 4.7997 1.7784 3.4425 6.5623 2.8334 1.8447 5.5988 6.9128 7.9240 7.0194 5.6877 2.6520 3.2551 3.8488 4.4411 5.4124 10.5091 2.1646 10.0817 1.3549 1.2531 4.6046 1.4280 1.5079 3.4248 9.0429 1.3504 1.3819 1.1817 3.8808 1.9842 1.6191 1.3795 3.6628 2.7128 3.4305 8.0712 1.6936 2.1510 4.4557 1.4170 1.0517 5.7214 1.1545 1.9416 1.3052 3.1631 1.5556 4.4724 1.7848 1.3802 1.4868 1.3597 4.8438 5.9917 8.5933 2.1540 6.2408 1.0537 2.2636 1.1231 2.0020 1.9970 1.1515 2.3890 7.3301 8.4139 7.9051 6.7247 6.5011 6.0625 5.3444 8.5074 1.0578 1.1036 1.0276 1.0852 1.0894 1.0895 1.0925 1.1046 1.0944 1.1061 1.0995 1.0964 1.0965 1.0773 1.0774
irintensity: 1.1176 0.4295 0.8456 5.2040 1.0893 2.2516 1.7500 0.4129 0.4705 0.6732 0.6975 0.0559 0.8978 3.0224 0.5926 1.3151 2.6164 2.4114 1.5503 3.8530 1.8718 1.2748 0.4650 3.4923 1.1909 7.6616 0.4191 1.2990 1.2146 4.9563 17.3618 6.3221 5.1389 11.3311 8.2886 35.3023 77.2200 36.6506 3.1247 29.1356 28.8777 22.3128 1.7578 10.2280 2.6794 9.5145 30.1101 23.0934 54.5894 38.6392 1.1647 9.2399 46.1259 0.5502 35.7779 2.1124 30.0249 13.7024 5.1976 11.8298 59.7210 4.9574 2.2147 5.8400 2.1745 10.4174 5.8911 10.9761 45.9150 3.6934 8.0724 7.8495 8.7871 38.3277 59.4340 0.7943 0.3173 147.8498 5.2779 11.5283 23.3966 81.6390 0.9927 34.6446 16.6754 0.5145 2.3690 6.3841 90.6315 13.4764 21.7532 59.8790 295.7275 14.2870 27.2006 31.0957 152.4783 18.5534 31.3378 117.7316 9.7085 115.9329 131.4371 35.0991 5.3960 84.1095 847.5819 949.6170 43.1576 21.5529 20.3610 0.7208 10.1605 4.1228 1.3437 6.7757 26.4067 9.4329 23.2344 1.1046 1.9807 58.3013 34.7742
temp: 298.150 k
press: 1.00000 atm
elementType: 17 17 16 8 7 7 7 7 7 6 6 6 6 6 6 6 6 6 6 6 6 6 6 6 6 6 6 6 1 1 1 1 1 1 1 1 1 1 1 1 1 1 1
symmnumber: 1
zpe: 809574.5 jmol-1
zpe.correction: 0.308351 hartree
zpe.thermalcorrener: 0.333930 hartree
zpe.thermalcorrenthalpy: 0.334875 hartree
zpe.thermalcorrgfe: 0.248017 hartree
zpe.sumelectzpe: -2398.236357 hartree
zpe.sumelectthermal: -2398.210777 hartree
zpe.sumelectthermalent: -2398.209833 hartree
zpe.sumelectthermalfe: -2398.296691 hartree
dipole: -2.7506 -4.7635 -0.9790
dipole: 5.5870
quadrupole: -192.5946 -196.9628 -179.8502
quadrupole: -23.6497 -1.6123 -9.3656
quadrupole: -2.7921 -7.1603 9.9524 -23.6497 -1.6123 -9.3656
hfenergy: -2398.5447075 hartree
pointgroup: C01 [X(C19H15Cl2N5O1S1)]
dipole: 1.0659123 -1.9221236 0.0308717 debye
polarizability: 453.1462443|-12.660593|286.534601|20.6906161|40.7627025|176.5065303 unknown
InChI: InChI=1S/C19H15Cl2N5OS/c1-28-19-23-15-16(22-10-11-7-8-13(20)14(21)9-11)24-18(27)25-17(15)26(19)12-5-3-2-4-6-12/h2-9,22,24H,10H2,1H3
charge 0 multiplicity 1
43 atoms
Cl 7.91805 -0.123991 1.16825
Cl 7.829051 -1.594917 -1.77481
S  -2.85024 -3.212062 -0.054559
O  -1.361728 4.163735 0.196325
N  -2.942519 -0.380359 -0.091991
N  1.634856 0.483967 0.299404
N  -0.826412 -1.290258 0.068522
N  0.05368 2.312019 0.24982
N  -2.372076 2.023198 0.043089
C  -0.761196 0.115755 0.112845
C  -2.051684 0.716925 0.025984
C  0.352717 0.965361 0.226165
C  -2.134802 -1.553195 -0.049141
C  -4.372243 -0.291859 -0.241975
C  2.853857 1.292856 0.441735
C  4.075026 0.553357 -0.092409
C  -1.307691 2.904184 0.155242
C  -5.095129 0.646098 0.534113
C  -5.042386 -1.11649 -1.177832
C  5.26864 0.526015 0.664042
C  4.044369 -0.081898 -1.359862
C  -6.494329 0.738924 0.382458
C  -6.444943 -1.025054 -1.30833
C  -7.176304 -0.099547 -0.529545
C  6.416614 -0.120256 0.160035
C  5.189824 -0.732506 -1.860329
C  6.379741 -0.751725 -1.101006
C  -1.264717 -4.178121 0.262096
H  1.714196 -0.535159 0.348598
H  3.02383 1.581143 1.49958
H  2.723828 2.232218 -0.134636
H  0.779053 3.02532 0.360195
H  -4.562454 1.307655 1.221007
H  -4.476742 -1.809324 -1.809137
H  5.317587 1.002808 1.648573
H  3.127003 -0.066222 -1.957655
H  -7.050735 1.469688 0.978927
H  -6.960969 -1.667472 -2.029928
H  -8.263547 -0.025465 -0.639436
H  5.172699 -1.222109 -2.838257
H  -0.550566 -3.987212 -0.550368
H  -1.571203 -5.235195 0.282063
H  -0.834008 -3.870928 1.224938
