program: Gaussian 09
title: 000232927
version: EM64L-G09RevD.01
frameworkgroup: C1[X(C18H21NO)]
method: RPBEPBE
basis: SDD
operation: Freq
keyword: #p
keyword: freq=noraman
keyword: PBEPBE/SDD
title: #p freq=noraman PBEPBE/SDD
converged: YES YES NO NO
title: Mulliken charges:
elementType: O N C C C C C C C C C C C C C C C C C C H H H H H H H H H H H H H H H H H H H H H
charge: -0.439792 -0.064614 -0.173504 0.394850 -0.518543 0.113869 -0.699334 -0.725482 0.052789 0.394727 -0.599290 -0.811417 0.445871 -0.391960 0.440022 -0.370985 -0.383109 -0.424762 -0.346886 -0.807798 0.231997 0.246414 0.209719 0.206955 0.245960 0.222664 0.218784 0.202535 0.221375 0.250920 0.235990 0.209292 0.355348 0.215568 0.224752 0.267928 0.230454 0.229165 0.231380 0.224690 0.233459
chargesum: 0.00000
title: Mulliken charges with hydrogens summed into heavy atoms:
elementType: O N C C C C C C C C C C C C C C C C C C
charge: -0.084444 -0.064614 0.058492 0.394850 -0.272129 0.113869 -0.036700 -0.081499 0.052789 0.394727 -0.377916 -0.115215 0.445871 -0.176392 0.440022 -0.146233 -0.115182 -0.194307 -0.117722 -0.118268
polarizability: 4.14546240e+02 -2.03427066e+01 2.09873513e+02 5.16459148e+00 1.52274216e+01 1.21221665e+02
1716.lowfreq: -9.9219 -5.0884 -0.0007 -0.0004 0.0003 2.2035 18.4099 27.6032 30.9196
frequency: 18.3085 27.2700 30.8184 40.4355 50.4337 78.2760 102.7303 104.0668 124.2499 177.5690 187.6680 202.5145 215.2366 227.9192 236.7296 255.7046 277.6614 311.3016 321.1199 344.9567 351.0368 361.6517 405.4750 411.2371 423.1207 441.3255 461.5477 470.9898 506.7964 520.4557 576.5378 584.6437 634.4204 666.9976 678.1493 725.8230 729.4397 738.5116 763.6991 822.3670 828.7001 837.0303 856.5971 857.3345 885.6444 890.3306 917.4630 951.8460 956.4927 981.0638 985.8389 994.8641 1002.7598 1010.4321 1028.8190 1044.4310 1046.5855 1097.3773 1115.5645 1118.2837 1130.5768 1147.8593 1181.3628 1191.4151 1206.9056 1222.0877 1243.3098 1258.7632 1290.8736 1298.2134 1307.8548 1340.6490 1351.0036 1371.3517 1372.1412 1385.5577 1390.4068 1397.2932 1398.0913 1406.0658 1413.2207 1450.6939 1465.8694 1467.1612 1468.4787 1473.8340 1478.4573 1483.4393 1488.6711 1501.5895 1512.2044 1562.9140 1580.2148 1599.5131 1616.4847 1623.6713 2938.7378 2972.4101 2975.7087 2975.8202 2981.2687 2994.8699 3053.1737 3061.2745 3063.0191 3070.6886 3076.6921 3085.9991 3089.1639 3091.7774 3100.7084 3111.8159 3119.5062 3138.1290 3141.3913 3158.6241 3581.6185
redmass: 1.2997 2.8423 2.2500 3.8605 4.1476 3.2944 1.6556 1.6723 4.2733 3.4623 3.2719 2.8347 2.0685 1.7635 3.3089 1.1142 3.0150 3.4579 2.9567 2.9913 1.3424 2.3208 2.8110 2.8422 4.5583 5.2048 3.3523 4.5423 3.1283 2.7469 4.8934 4.2850 6.8530 5.6034 4.3802 3.3108 4.7993 3.0159 4.0381 2.9124 1.6531 1.4484 1.9150 1.7764 2.5642 1.6883 1.1873 1.3559 1.4351 1.5600 1.4159 1.3762 1.4786 2.8107 2.7676 1.5598 1.5658 1.8893 1.7354 1.9814 1.8077 2.0874 1.2000 1.5322 1.9270 2.8553 2.2861 1.7391 1.6908 1.4422 1.5479 1.6769 2.4760 2.6239 1.4484 2.3458 1.3074 1.2950 1.3153 2.8524 3.4593 1.0577 1.0543 1.0554 1.0474 1.1108 1.1465 1.0588 1.0581 2.8265 3.1855 6.4047 6.0792 6.4806 6.4195 6.4919 1.0853 1.0355 1.0369 1.0366 1.0368 1.0830 1.0971 1.0959 1.0995 1.0991 1.0999 1.0987 1.1003 1.0993 1.0908 1.0873 1.0892 1.0962 1.0898 1.0950 1.0659
irintensity: 0.1823 0.5856 0.3755 0.4036 0.5825 0.9811 1.3607 1.2384 0.4245 1.0821 2.4094 11.1378 0.2347 0.5466 4.3133 0.0020 1.4184 0.9832 2.5593 3.6289 94.1275 45.3162 1.1054 0.4364 3.4060 15.6370 3.5036 11.4671 11.2859 24.2169 0.1740 17.7079 1.4636 3.0580 0.8807 5.6342 6.7273 0.2811 0.5566 13.0297 29.8298 25.1502 17.0955 9.8965 7.7138 22.1244 4.1757 1.4004 1.5504 11.2330 7.5466 3.7564 3.2478 7.1740 24.0871 16.2927 12.8709 39.9230 12.8814 73.6032 152.3102 65.6107 15.4851 1.3548 12.2473 0.7155 5.3490 95.2671 6.7355 7.6063 11.6029 13.5431 1.0864 33.9177 35.0299 11.5580 13.5822 3.1948 14.4169 12.2643 6.3090 17.6416 5.5054 8.7747 13.0756 13.2732 45.4098 10.6007 10.3262 7.0306 68.5597 7.0876 7.6917 11.2260 94.4660 3.1327 60.9565 26.5609 59.4023 31.3316 30.1383 5.3212 20.3047 18.3526 5.4873 87.0577 56.5385 21.1356 17.4013 21.8317 41.6521 14.2842 23.1843 32.2026 4.9819 6.4139 61.5190
temp: 298.150 k
press: 1.00000 atm
elementType: 8 7 6 6 6 6 6 6 6 6 6 6 6 6 6 6 6 6 6 6 1 1 1 1 1 1 1 1 1 1 1 1 1 1 1 1 1 1 1 1 1
symmnumber: 1
zpe: 890483.7 jmol-1
zpe.correction: 0.339167 hartree
zpe.thermalcorrener: 0.359852 hartree
zpe.thermalcorrenthalpy: 0.360796 hartree
zpe.thermalcorrgfe: 0.287567 hartree
zpe.sumelectzpe: -827.036731 hartree
zpe.sumelectthermal: -827.016046 hartree
zpe.sumelectthermalent: -827.015102 hartree
zpe.sumelectthermalfe: -827.088331 hartree
dipole: 0.6642 0.4427 -0.5876
dipole: 0.9912
quadrupole: -98.7005 -108.0340 -123.1137
quadrupole: -9.8030 2.1763 2.6300
quadrupole: 11.2489 1.9154 -13.1643 -9.8030 2.1763 2.6300
hfenergy: -827.3758982 hartree
pointgroup: C01 [X(C18H21N1O1)]
dipole: 0.2596132 -0.2247948 0.1847453 debye
polarizability: 414.2762414|21.5124629|197.3150219|4.1405815|34.9827647|134.050154 unknown
InChI: InChI=1S/C18H21NO/c1-12(2)16-10-17(14(4)9-18(16)20)19-11-15-7-5-13(3)6-8-15/h5-12,20H,1-4H3
charge 0 multiplicity 1
41 atoms
O  -5.229047 -0.847046 0.006083
N  0.416508 -0.706778 -0.226004
C  -4.033245 1.68011 0.399626
C  -3.184031 0.425957 0.180385
C  -1.775689 0.440453 0.134466
C  -3.817311 -0.828358 -0.041931
C  -4.601079 2.186329 -0.957811
C  -3.286362 2.817182 1.132321
C  -0.999083 -0.726417 -0.128372
C  -1.66084 -1.969579 -0.378404
C  -3.070849 -1.996499 -0.3182
C  -0.863518 -3.223942 -0.669571
C  2.612237 0.205469 0.320536
C  1.153096 0.11467 0.483848
C  5.457131 0.42019 0.042934
C  3.359166 1.093692 1.139965
C  3.308809 -0.576454 -0.645231
C  4.759427 1.198275 1.001247
C  4.703291 -0.468329 -0.776757
C  6.964145 0.520482 -0.10891
H  -4.900167 1.379355 1.020063
H  -1.255118 1.394357 0.270674
H  -3.77939 2.491863 -1.632513
H  -5.260871 3.060067 -0.799176
H  -5.188321 1.396796 -1.456975
H  -2.854996 2.472241 2.089972
H  -3.98465 3.646242 1.348462
H  -2.468053 3.23248 0.513926
H  -3.592582 -2.947645 -0.494148
H  -0.086869 -3.017827 -1.426757
H  -0.329301 -3.578983 0.231681
H  -1.514788 -4.040648 -1.026637
H  -5.567598 -1.764588 -0.141609
H  0.716695 0.773111 1.266203
H  2.837382 1.704081 1.888443
H  2.725971 -1.255932 -1.275567
H  5.318648 1.890192 1.642333
H  5.226149 -1.077047 -1.525307
H  7.248198 0.758128 -1.151183
H  7.387155 1.302599 0.544443
H  7.456449 -0.436649 0.149449
